{"text_format":"3","workbook":"xlsx","n_sheets":51,"sheets":["ML","Ts","Bia1","TM","PLthamtra","Tong hop kinh phi","TH Hang muc","CP xay dung","Dutoan XD","Tkthep","Don gia chi tiet","VLSG XD","Tong hop & Chenh lech","Gia vat lieu","Gia vua","Nhan cong","Gia ca may","NhienlieuXD","Vật tư điều chỉnh xây dựng","Số liệu điều chỉnh HĐ xây dựng","Du thau","VCLC XD","Gia tri vat tu","TDTC XD","CP tu van","Cp khac","CP Du phong","QD957","Bia2","TH CP thiet bi","CP mua sam tbi","CP dao tao","Hang muc TB","Lap dat","Dutoan lap dat","Don gia lap dat","TH&Chenh lech LD","VLSG TB","VL hien truong LD","PLV lap dat","Nhan cong LD","Gia ca may LD","NhienlieuTB","Vật tư điều chỉnh thiết bị","Số liệu điều chỉnh HĐ thiết bị","Du thau LD","VCLC TB","GVT TB","TDLD TB","NhanCong","Morong"],"not_rendered":{"images":3,"macros":1,"defined_names":848,"comments":9},"read":"whole","date_system":"1900"}

{"sheet":"ML","index":0,"n_rows":26,"n_cols":10,"rows_kept":26}
[null,"MỤC LỤC"]
[]
["STT","TÊN BẢNG","TÊN SHEET",null,"STT","TÊN BẢNG","TÊN SHEET",null,"STT","ĐỊA CHỈ TRÊN MẠNG"]
[1,"Thuyết minh lập dự toán","TM",null,21,"Bảng tính nội suy các định mức tỷ lệ","QD957",null,1,"Diễn đàn DutoanGXD.vn"]
[2,"Bảng tổng hợp: Dự toán công trình; Chi phí tư vấn; Chi phí khác","THKP",null,22,"Bảng tính dự phòng phí","Gdp",null,2,"Trang tin Giaxaydung.vn"]
[3,"Phụ lục dùng cho thẩm tra dự toán","PLthamtra",null,23,"Bảng các thông số ban đầu về công trình","Ts",null,3,"Trang Gxd.vn web và tìm kiếm văn bản"]
[null,"DỰ TOÁN CHI PHÍ XÂY DỰNG",{"$nulls":3},"DỰ TOÁN CHI PHÍ THIẾT BỊ",null,null,4,"Siêu thị phần mềm xây dựng"]
[4,"Bìa (bìa ngoài, bìa lót phần xây dựng)","Bia1",null,24,"Bìa (bìa ngoài, bìa lót phần thiết bị)","Bia2",null,5,"Cộng đồng sử dụng Dự toán GXD"]
[5,"Tổng hợp dự toán chi phí xây dựng các hạng mục","THGxd",null,25,"Tổng hợp dự toán lắp đặt thiết bị các hạng mục","THGld",null,6,"Diễn đàn Giá Xây Dựng"]
[6,"Bảng tổng hợp dự toán chi phí xây dựng","Gxd",null,26,"Bảng tổng hợp dự toán chi phí lắp đặt thiết bị","Gld",null,7,"Thư viện thuvien.gxd.vn"]
[7,"Bảng dự toán chi phí xây dựng","Dutoan XD",null,27,"Bảng dự toán chi phí lắp đặt thiết bị","Dutoan TB",null,8,"Dữ liệu csv lập dự toán trên DutoanGXD.vn"]
[8,"Bảng phân tích đơn giá chi tiết và phân tích vật tư","DGCT XD",null,28,"Bảng phân tích đơn giá chi tiết lắp đặt thiết bị","DGCT TB",null,9,"Lập trình VBA, Macro4 trong Excel"]
[9,"Bảng tổng hợp và tính chênh lệch vật tư xây dựng","TH&CLVT XD",null,29,"Bảng tổng hợp và tính chênh lệch vật tư lắp đặt thiết bị","TH&CLVT TB",null,10,"Công bố giá vật liệu địa phương"]
[10,"Bảng tính giá vật liệu đến hiện trường xây dựng","VLHT XD",null,30,"Bảng tính giá vật liệu đến hiện trường lắp đặt thiết bị","VLHT TB",null,11,"Báo giá vật liệu xây dựng từ thị trường"]
[11,"Bảng phụ lục vữa thi công xây dựng","PLV XD",null,31,"Bảng phụ lục vữa lắp đặt thiết bị","PLV TB",null,12,"Quản lý dự án đầu tư xây dựng công trình"]
[12,"Bảng lương nhân công xây dựng","NC XD",null,32,"Bảng lương nhân công lắp đặt thiết bị","NC TB",null,13,"Quản lý chi phí đầu tư xây dựng"]
[13,"Bảng giá ca máy và thiết bị thi công xây dựng","GCM XD",null,33,"Bảng giá ca máy và thiết bị thi công lắp đặt thiết bị","GCM TB",null,14,"Tải cơ sở dữ liệu CSV"]
[14,"Bảng thống kê cốt thép","Tkthep",null,34,"Bảng dự toán dự thầu lắp đặt thiết bị","DTDT TB",null,15,"Thư viện diễn đàn"]
[15,"Bảng dự toán dự thầu thi công xây dựng","DTDT XD",null,35,"Bảng giá trị vật tư lắp đặt thiết bị","GVT TB"]
[16,"Bảng giá trị vật tư thi công xây dựng","GVT XD",null,36,"Bảng tổng hợp vật tư xây dựng vận chuyển lên cao","VCLC TB"]
[17,"Bảng tổng hợp vật tư xây dựng vận chuyển lên cao","VCLC XD",null,37,"Bảng tổng hợp hao phí nhiên liệu, năng lượng lắp đặt thiết bị","Nhienlieutb"]
[18,"Bảng tổng hợp hao phí nhiên liệu, năng lượng thi công xây dựng","NhienlieuXD",null,38,"Bảng giá trị chênh lệch vật liệu tính vào sau chi phí lắp đặt thiết bị trước thuế","VLSG TB"]
[19,"Bảng giá trị chênh lệch vật liệu tính vào sau chi phí xây dựng trước thuế","VLSG XD",null,39,"Bảng tiến độ lắp đặt thiết bị","TDLD TB"]
[20,"Bảng tiến độ thi công xây dựng","TDTC XD",null,40,"Bảng dự toán chi phí mua sắm thiết bị","Gms"]
[{"$nulls":4},41,"Bảng tổng hợp chi phí đào tạo chuyển giao công nghệ","Gdtcg"]
[{"$nulls":4},42,"Bảng tổng hợp dự toán chi phí thiết bị","Gtb"]

{"sheet":"Ts","index":1,"n_rows":51,"n_cols":32,"rows_kept":51,"merged":[[15,4,16,4],[15,5,16,5],[15,8,16,8],[17,4,18,4],[17,8,18,8],[19,4,20,4],[19,8,20,8],[21,4,23,4],[21,8,23,8],[24,4,25,4],[24,8,25,8]]}
["CÁC THÔNG SỐ BAN ĐẦU VỀ CÔNG TRÌNH",{"$nulls":3},"WWW.GIAXAYDUNG.VN CHUNG TAY XÂY DỰNG ĐẤT NƯỚC",{"$nulls":5},"C:\\Du toan GXD\\Dulieu",7,"HoChiMinh2006",null,"Trạng thái (1-Kích hoạt; 0 - Không kích hoạt)",null,null,"Bậc hàng","Hệ số","VAT",{"$nulls":3},"Các định nghĩa trong phần mềm",{"$nulls":5},"STT","CÁC TÙY CHỌN","GIÁ TRỊ"]
["I.","THÔNG TIN CHUNG",null,null,"BẢNG 3.7. ĐỊNH MỨC CHI PHÍ TRỰC TIẾP KHÁC",{"$nulls":5},"C:\\Du toan GXD\\Dulieu\\HoChiMinh2006\\CVC89.2000.csv",6,null,null,1,null,null,1,{"v":1,"d":"1.00"},1.05,{"$nulls":10},"Bảng Dutoan"]
[1,"CÔNG TRÌNH: ",null,null,"STT","LOẠI CÔNG TRÌNH","TT",{"$nulls":3},"C:\\Du toan GXD\\Dulieu\\HoChiMinh2006\\DGHoChiMinh2006.csv",0,null,null,1,null,null,2,{"v":1.1,"d":"1.10"},{"$nulls":4},"Vật liệu",{"$nulls":5},1,"Tra lại tên công việc khi thay đổi mã đơn giá",0]
[null,"NHÀ BIỆT THỰ GXD",null,null,1,"Công trình dân dụng",{"$nulls":4},"C:\\Du toan GXD\\Dulieu\\HoChiMinh2006\\DMHCM1776+1777+1779.csv",3,null,null,1,null,null,3,{"v":1.3,"d":"1.30"},{"$nulls":4},"Vật liệu phụ",{"$nulls":5},2,"Tính lại khi đơn giá khi thay đổi mã vữa",1]
[2,"HẠNG MỤC: ",{"$nulls":3},"Trong đô thị",{"v":0.025,"d":"2.5%"},{"$nulls":3},"C:\\Du toan GXD\\Dulieu\\HoChiMinh2006\\GCMHoChiMinh2006.csv",2,null,null,1,null,null,4,{"v":1.4,"d":"1.40"},{"$nulls":4},"Vật liệu khác",null,1,{"$nulls":3},3,"Sử dụng phụ lục vữa",1]
[null,"ĐỔI BẢNG MÃ FONT RẤT ĐƠN GIẢN TRONG DỰ TOÁN GXD",{"$nulls":3},"Ngoài đô thị",{"v":0.02,"d":"2%"},{"$nulls":3},"C:\\Du toan GXD\\Dulieu\\HoChiMinh2006\\GVTHoChiMinh2006.csv",1,null,null,1,null,null,5,{"$nulls":5},"Nhân công",{"$nulls":6},"Bảng TH&CLVT và bảng ĐGCT"]
[3,"Chủ đầu tư:",null,null,2,"Công trình công nghiệp",{"v":0.02,"d":"2%"},{"$nulls":3},"C:\\Du toan GXD\\Dulieu\\HoChiMinh2006\\PLVHoChiMinh2006.csv",5,null,null,1,{"$nulls":8},"Máy thi công",{"$nulls":5},4,"Tổng hợp theo tên vật tư",1]
[null,"CÔNG TY GIÁ XÂY DỰNG",{"$nulls":3},"Công tác xây dựng trong hầm lò, hầm thủy điện",{"v":0.065,"d":"6.5%"},{"$nulls":3},"C:\\Du toan GXD\\Dulieu\\HoChiMinh2006\\TDVTHoChiMinh2006.csv",4,null,null,1,{"$nulls":8},"Máy khác",{"$nulls":5},5,"Bóc thép theo diễn giải",0]
[4,"Địa điểm xây dựng công trình:",null,null,3,"Công trình giao thông",{"v":0.02,"d":"2%"},{"$nulls":10},"Dữ liệu cước vận chuyển",{"$nulls":5},"Các dòng chi phí",{"$nulls":5},6,"Phân tích đơn giá chi tiết theo vữa",1]
[null,"SỐ 2A, NGÕ 55, NGUYỄN NGỌC NẠI, THANH XUÂN, HÀ NỘI",{"$nulls":3},"Công tác xây dựng trong đường hàm giao thông",{"v":0.065,"d":"6.5%"},{"$nulls":10},"Loại đường","Hệ số bậc hàng","Bậc hàng",{"$nulls":3},"Chi phí trực tiếp khác (TT)",{"$nulls":5},7,"Tính ĐGCT theo đơn giá đầy đủ",1]
["II.","CÁC HỆ SỐ, ĐỊNH MỨC TỶ LỆ",null,null,4,"Công trình thủy lợi",{"v":0.02,"d":"2%"},{"$nulls":10},1,1,1,{"$nulls":3},"Chi phí trực tiếp (T)",{"$nulls":5},8,"Dùng hệ số trong đơn giá chi tiết",0]
[1,"Hệ số vật liệu",{"v":1,"d":"1.000"},null,5,"Công trình hạ tầng kỹ thuật",{"$nulls":11},2,1.1,2,{"$nulls":3},"Chi phí chung (C)",{"$nulls":5},9,"Phân tích đơn giá khảo sát",1]
[2,"Hệ số nhân công",{"v":1,"d":"1.000"},null,null,"Trong đô thị",{"v":0.02,"d":"2%"},{"$nulls":10},3,1.3,3,{"$nulls":3},"Thu nhập chịu thuế tính trước (TL)",{"$nulls":5},10,"Tính Giá ca máy",2]
[3,"Hệ số máy xây dựng",{"v":1,"d":"1.000"},null,null,"Ngoài đô thị",{"v":0.015,"d":"1.5%"},{"$nulls":10},4,1.4,4,{"$nulls":3},"Chi phí xây dựng trước thuế (G)",{"$nulls":6},"Chi phí chung (Thông tư 04/2010)"]
[4,"Định mức chi phí trực tiếp khác (TT)",{"v":2.5,"d":"2.5%"},null,"BẢNG 3.8. ĐỊNH MỨC CHI PHÍ CHUNG, THU NHẬP CHỊU THUẾ TÍNH TRƯỚC",{"$nulls":12},5,{"$nulls":5},"Thuế giá trị gia tăng (GTGT)",{"$nulls":5},11,"Chi phí trực tiếp/Chi phí nhân công(1: Giá trị được chọn; 0: giá trị bỏ chọn)",1]
[5,"Định mức chi phí chung (C) ",{"v":6.5,"d":"6.5%"},null,"STT","LOẠI CÔNG TRÌNH","CP CHUNG (C) ",null,"TNCTTT (TL)",{"$nulls":8},6,{"$nulls":5},"Chi phí nhà tạm tại hiện trường để ở và điều hành thi công (GXDNT)",{"$nulls":6},"Nối với bảng Đơn giá chi tiết"]
[6,"Định mức thu nhập chịu thuế tính trước (TL)",{"v":5.5,"d":"5.5%"},{"$nulls":3},"TRÊN T","Trên NC",{"$nulls":15},"Chi phí xây dựng sau thuế (GXD)",{"$nulls":5},12,"Nối giá vật tư từ bảng Tổng hợp và Chênh lệch",1]
[7,"Thuế suất thuế giá trị gia tăng (TGTGT-XD)",{"v":10,"d":"10.0%"},null,1,"Công trình dân dụng",{"v":0.065,"d":"6.5%"},null,{"v":0.055,"d":"5.5%"},{"$nulls":8},"Hạng mục xây dựng",null,null,"Hạng mục thiết bị",null,null,"Tổng cộng",{"$nulls":5},13,"Nối giá vật tư từ bảng Giá trị vật tư",0]
[8,"Tỷ lệ chi phí XD nhà tạm tại hiện trường để ở và điều hành thi công",{"v":1,"d":"1.0%"},null,null,"Công trình tu bổ, phục hồi di tích lịch sử, văn hóa",{"v":0.1,"d":"10%"},{"$nulls":11},0,{"$nulls":4},"BẢNG DỰ TOÁN",{"$nulls":5},14,"Nối đơn giá với bảng Dự toán",0]
[9,"Chi phí khảo sát",{"v":5,"d":"5.0%"},null,2,"Công trình công nghiệp",{"v":0.055,"d":"5.5%"},null,{"v":0.06,"d":"6%"},{"$nulls":9},{"$f":"'Dutoan XD'!E9","v":"L¾p ®Æt ®Ìn èng 1,2m - 2 bãng"},{"$nulls":4},"BẢNG TIÊN LƯỢNG",{"$nulls":6},"Nối với bảng Tổng hợp và chênh lệch"]
["III.","CHẾ ĐỘ TIỀN LƯƠNG",{"$nulls":3},"Công tác xây dựng trong hầm lò, hầm thủy điện",{"v":0.07,"d":"7%"},{"$nulls":16},"BẢNG GIÁ CA MÁY VÀ THIẾT BỊ THI CÔNG XÂY DỰNG",{"$nulls":5},15,"Nối giá vật liệu từ bảng Giá vật liệu đến hiện trường",1]
[1,"Mức lương tối thiểu chung (LTTC)",{"v":1050000,"d":"1,050,000 đ/tháng"},null,3,"Công trình giao thông",{"v":0.055,"d":"5.5%"},null,{"v":0.06,"d":"6%"},{"$nulls":14},"BẢNG TÍNH BÙ GIÁ CA MÁY THEO TT06",{"$nulls":5},16,"Nối giá nhân công từ bảng Lương nhân công",1]
[2,"Mức lương tối thiểu vùng (LTTV)",{"v":2000000,"d":"2,000,000 đ/tháng"},null,null,"Công tác duy tu sửa chữa thường xuyên  đường bộ, đường sắt, đường thủy nội địa, hệ thống báo hiệu hàng hải và đường thủy nội địa","",{"v":0.66,"d":"66%"},{"$nulls":15},"BẢNG TÍNH BÙ GIÁ CA MÁY (ĐƠN GIẢN)",{"$nulls":5},17,"Nối giá ca máy từ bảng Giá ca máy",1]
[3,"Phụ cấp lưu động (%LTTC)",{"v":0.2,"d":"20%"},null,null,"Công trình hầm giao thông",{"v":0.07,"d":"7%"},{"$nulls":16},"PHÂN TÍCH HAO PHÍ VẬT TƯ THEO ĐỊNH MỨC",{"$nulls":5},18,"Nối giá vữa từ bảng Phụ lục vữa",1]
[4,"Lương phụ (%LCB)",{"v":0.12,"d":"12%"},null,4,"Công trình thủy lợi",{"v":0.055,"d":"5.5%"},null,{"v":0.055,"d":"5.5%"},{"$nulls":14},"BẢNG PHÂN TÍCH ĐƠN GIÁ CHI TIẾT",{"$nulls":6},"Nối với bảng Giá trị vật tư"]
[5,"Chi phí khoán trực tiếp (%LCB)",{"v":0.04,"d":"4%"},"Tìm ở văn bản nào?",null,"Đào, đắp đất công trình thủy lợi bằng thủ công",null,{"v":0.51,"d":"51%"},{"$nulls":15},"Giá thành khảo sát (Gks)",{"$nulls":5},19,"Nối giá vật liệu từ bảng Giá vật liệu đến hiện trường",0]
[6,"Phụ cấp không ổn định sản xuất (%LCB)",null,null,5,"Công trình hạ tầng kỹ thuật",{"v":0.05,"d":"5%"},null,{"v":0.055,"d":"5.5%"},{"$nulls":14},"Chi phí lập PA, báo cáo KS (BC)",{"$nulls":5},20,"Nối giá nhân công từ bảng Lương nhân công",0]
[7,"Phụ cấp khu vực (%LTTC)",null,null,6,"Công tác lắp đặt thiết bị công nghệ trong các công trình xây dựng, công tác xây lắp đường dây, công tác thí nghiệm hiệu chỉnh điện đường dây và trạm biến áp, công tác thí nghiệm vật liệu, cấu kiện và kết cấu xây dựng","",{"v":0.65,"d":"65%"},{"v":0.06,"d":"6%"},{"$nulls":14},"Giá trị dự toán khảo sát trước thuế (G)",{"$nulls":5},21,"Nối giá ca máy từ bảng Giá ca máy",0]
[8,"Phụ cấp thu hút (%LCB)",null,null,"Các bảng 3.7 và 3.8 trích từ Thông tư số 04/2010/TT-BXD ngày 26/05/2010 của Bộ Xây Dựng.",{"$nulls":18},"Giá trị khảo sát sau thuế (GXD)",{"$nulls":5},22,"Nối giá vữa từ bảng Phụ lục vữa",0]
[9,"Phụ cấp độc hại (%LTTC)",{"$nulls":21},"Chi phí chỗ ở tạm thời (Gnt)",{"$nulls":6},"Chung"]
[10,"Phụ cấp đặc biệt (%LCB)",{"$nulls":21},"Chi phí chuyển quân, chuyển máy (Gdc)",{"$nulls":5},23,"Đổi nhóm nhân công toàn bộ",1]
[11,"Phụ cấp làm ca đêm (%LCB)",{"$nulls":21},"Chi phí dự phòng (GDP)",{"$nulls":5},24,"Tổng hợp dự toán theo dạng bảng",1]
["IV.","GIÁ NHIÊN LIỆU, NĂNG LƯỢNG (TRƯỚC VAT)",{"$nulls":27},25,"Phương pháp lập dự toán",1]
[null,"Giá nhiên liệu trong bảng giá ca máy địa phương (giá ca máy gốc)",{"$nulls":27},26,"Tùy chọn kết xuất dữ liệu",0]
[1,"Xăng (đồng/lít)",{"v":19000,"d":"19,000"},{"$nulls":26},27,"Hiển thị trang tin khi khởi động",1]
[2,"Dầu Diezel (đồng/lít)",{"v":18955,"d":"18,955"},{"$nulls":26},28,"Mã vữa","V10875"]
[3,"Ma dút (đồng/lít)",{"v":13548,"d":"13,548"}]
[4,"Dầu hỏa (đồng/lít)"]
[5,"Dầu DO (đồng/lít)",null,1000]
[6,"Điện (đồng/kw)",{"v":1242,"d":"1,242"}]
[null,"Giá nhiên liệu ở thời điểm hiện tại để tính giá ca máy và bù giá ca máy"]
[1,"Xăng (đồng/lít)",{"v":19909,"d":"19,909"}]
[2,"Dầu Diezel (đồng/lít)",{"v":19545,"d":"19,545"}]
[3,"Ma dút (đồng/lít)",{"v":14548,"d":"14,548"}]
[4,"Dầu hỏa (đồng/lít)"]
[5,"Dầu DO (đồng/lít)"]
[6,"Điện (đồng/kw)",{"v":2061,"d":"2,061"}]
[]
[]
[]
["Lưu ý:","Nếu sử dụng đơn giá địa phương để lập dự toán, hãy chọn hệ số ở phần hướng dẫn chung trong cuốn đơn giá của từng tỉnh."]

{"sheet":"Bia1","index":2,"n_rows":45,"n_cols":14,"rows_kept":45,"merged":[[15,4,15,7]]}
[]
["CÔNG TY CP GIÁ XÂY DỰNG",{"$nulls":4},"CỘNG HOÀ XÃ HỘI CHỦ NGHĨA VIỆT NAM"]
["WWW.GIAXAYDUNG.VN",{"$nulls":4},"Độc lập - Tự do - Hạnh phúc"]
[]
["          Số : ……./………."]
[]
[]
[]
["DỰ TOÁN XÂY DỰNG CÔNG TRÌNH"]
[]
[{"$nulls":3},"DỰ ÁN:"]
[{"$nulls":3},"CÔNG TRÌNH:",{"$f":"Ts!B4","v":"NHÀ BIỆT THỰ GXD"}]
[{"$nulls":3},"ĐỊA ĐIỂM:",{"$f":"E44","v":"SỐ 2A, NGÕ 55, NGUYỄN NGỌC NẠI, THANH XUÂN, HÀ NỘI"}]
[{"$nulls":3},"CHỦ ĐẦU TƯ:",{"$f":"E45","v":"CÔNG TY GIÁ XÂY DỰNG"}]
[]
[{"$nulls":3},"Giá trị dự toán:",{"$f":"'Tong hop kinh phi'!G17","v":{"v":128536000,"d":"128,536,000"}},{"$nulls":3},"đồng"]
[{"$nulls":3},{"$f":"\"(Bằng chữ: \"&vnd(E16)&\")\"","v":"(Bằng chữ: Một trăm hai mươi tám triệu năm trăm ba mươi sáu nghìn đồng.)"}]
[]
[]
[{"$nulls":7},"Hà Nội, ","ngày",{"$f":"NOW()","v":"2013-12-24T23:43:21.750"},"tháng",{"$f":"NOW()","v":"2013-12-24T23:43:21.750"},"năm",{"$f":"NOW()","v":"2013-12-24T23:43:21.750"}]
[{"$nulls":8},"GIÁM ĐỐC"]
[]
[]
[]
[]
[]
[{"$nulls":8},"NGUYỄN THÀNH CÔNG"]
[]
[]
["CÔNG TY CP GIÁ XÂY DỰNG",{"$nulls":4},"CỘNG HOÀ XÃ HỘI CHỦ NGHĨA VIỆT NAM"]
["WWW.GIAXAYDUNG.VN",{"$nulls":4},"Độc lập - Tự do - Hạnh phúc"]
{"$rows_empty":7}
["DỰ TOÁN XÂY DỰNG CÔNG TRÌNH"]
["Số : ……./……."]
[]
[{"$nulls":3},"CÔNG TRÌNH: ",{"$f":"IF(Ts!B4=\"\",\"\",Ts!B4)","v":"NHÀ BIỆT THỰ GXD"}]
[{"$nulls":3},"HẠNG MỤC: ",{"$f":"IF(Ts!B6=\"\",\"\",Ts!B6)","v":"ĐỔI BẢNG MÃ FONT RẤT ĐƠN GIẢN TRONG DỰ TOÁN GXD"}]
[{"$nulls":3},"ĐỊA ĐIỂM:",{"$f":"Ts!B10","v":"SỐ 2A, NGÕ 55, NGUYỄN NGỌC NẠI, THANH XUÂN, HÀ NỘI"}]
[{"$nulls":3},"CHỦ ĐẦU TƯ:",{"$f":"Ts!B8","v":"CÔNG TY GIÁ XÂY DỰNG"}]

{"sheet":"TM","index":3,"n_rows":27,"n_cols":7,"rows_kept":27,"merged":[[9,2,9,11],[10,2,10,11],[24,2,24,3],[24,5,24,6],[25,4,25,5]]}
[null,null,"THUYẾT MINH LẬP DỰ TOÁN"]
[null,null,{"$f":"'Bia1'!D42&'Bia1'!E42","v":"CÔNG TRÌNH: NHÀ BIỆT THỰ GXD"}]
[null,null,{"$f":"'Bia1'!D43&'Bia1'!E43","v":"HẠNG MỤC: ĐỔI BẢNG MÃ FONT RẤT ĐƠN GIẢN TRONG DỰ TOÁN GXD"}]
[]
[null,"MHVB","CƠ SỞ LẬP DỰ TOÁN:"]
[null,null,"  1. Các văn bản:"]
[null,null,"      - Nghị định số 112/2009/NĐ-CP ngày 14/12/2009 của Chính phủ về quản lý chi phí đầu tư xây dựng công trình."]
[null,null,"      - Thông tư số 04/2010/TT-BXD ngày 26/05/2010 của Bộ Xây dựng hướng dẫn lập và quản lý chi phí đầu tư xây dựng công trình."]
[null,null,"      - Thông tư số 06/2010/TT-BXD ngày 26/05/2010 của Bộ Xây dựng hướng dẫn phương pháp xác định giá ca máy và thiết bị thi công."]
[null,null,"      - Quyết định số ...."]
[null,null,"      - Thông tư số 129/2008/TT-BTC ngày 26/12/2008 của Bộ Tài chính hướng dẫn thi hành một số điều của Luật thuế giá trị gia tăng và hướng dẫn thi hành Nghị định số 123/2008/NĐ-CP ngày 08/12/2008 của Chính phủ quy định chi tiết hướng dẫn thi hành một số điều của Luật thuế giá trị gia tăng."]
[null,null,"      - Công bố giá vật liệu Liên Sở Xây dựng - Tài chính tỉnh ...."]
[null,null,"      - Căn cứ vào khối lượng xác định từ hồ sơ bản vẽ thiết kế."]
[null,null,"      - Căn cứ vào các thông tư định mức, đơn giá của Nhà nước và địa phương ban hành."]
[null,null,"      - Một số tài liệu khác có liên quan."]
[]
[null,null,"  2. Định mức:"]
[null,null,"      - Áp dụng định mức dự toán XDCT phần xây dựng ban hành kèm theo văn bản số 1776/2007/BXD-VP ngày 16/08/2007 của Bộ Xây dựng."]
[null,null,"      - Áp dụng định mức dự toán XDCT phần lắp đặt ban hành kèm theo văn bản số 1777/2007/BXD-VP ngày 16/08/2007 của Bộ Xây dựng."]
[]
[null,null,"  3. Đơn giá áp dụng:"]
[null,null,"      - Đơn giá xây dựng công trình phần xây dựng ban hành kèm theo quyết định số .../2006/QĐ-UBND ngày .../.../2006 của UBND Tỉnh ...."]
[null,null,"      - Đơn giá xây dựng công trình phần lắp đặt ban hành kèm theo quyết định số .../2006/QĐ-UBND ngày .../.../2006 của UBND ...."]
[null,null,"      - Bảng giá ca máy và thiết bị thi công ban hành kèm theo quyết định số .../2006/QĐ-UBND ngày .../.../2006 của Tỉnh ...."]
[]
[{"$nulls":3},"Giá trị dự toán",{"$f":"'Tong hop kinh phi'!G17","v":{"v":128536000,"d":"128,536,000"}},null,"đồng"]
[{"$nulls":3},{"$f":"\"(Bằng chữ: \"&vnd(F44)&\")\"","v":"(Bằng chữ: )"}]

{"sheet":"PLthamtra","index":4,"n_rows":19,"n_cols":5,"rows_kept":19,"hidden":true}
["PHỤ LỤC"]
["Kèm theo công văn số           /VKT/TTTT ngày       tháng       năm 2012 của "]
[]
["KẾT QUẢ THẨM ĐỊNH / THẨM TRA DỰ TOÁN"]
[]
[{"$f":"'Bia1'!D42&'Bia1'!E42","v":"CÔNG TRÌNH: NHÀ BIỆT THỰ GXD"}]
[{"$f":"'Bia1'!D43&'Bia1'!E43","v":"HẠNG MỤC: ĐỔI BẢNG MÃ FONT RẤT ĐƠN GIẢN TRONG DỰ TOÁN GXD"}]
[]
[]
["TT","Nội dung chi phí","Giá trị đề nghị","Giá trị thẩm tra","Tăng, giảm"]
["[1]","[2]","[3]","[4]","[5]"]
[1,"Chi phí xây dựng (GXD)",null,{"$f":"'Tong hop kinh phi'!G7","v":{"v":109606069.10259347,"d":"109,606,069"}},{"$f":"D12-C12","v":{"v":109606069.10259347,"d":"109,606,069"}}]
[2,"Chi phí thiết bị (GTB)",null,{"$f":"'Tong hop kinh phi'!G10","v":0},{"$f":"D13-C13","v":0}]
[null,"Chi phí bồi thường, hỗ trợ và tái định cư",null,{"$f":"'Tong hop kinh phi'!G11","v":0},{"$f":"D14-C14","v":0}]
[3,"Chi phí quản lý dự án (GQLDA)",null,{"$f":"'Tong hop kinh phi'!G12","v":{"v":2514961.0764995078,"d":"2,514,961"}},{"v":2514961.0764995078,"d":"2,514,961"}]
[4,"Chi phí tư vấn đầu tư xây dựng (GTV)",null,{"$f":"'Tong hop kinh phi'!G13","v":{"v":9294000,"d":"9,294,000"}},{"v":9294000,"d":"9,294,000"}]
[5,"Chi phí khác (GK)",null,{"$f":"'Tong hop kinh phi'!G14","v":{"v":1000000,"d":"1,000,000"}},{"v":1000000,"d":"1,000,000"}]
[6,"Chi phí dự phòng (GDP)",null,{"$f":"'Tong hop kinh phi'!G15","v":{"v":6120751.508954649,"d":"6,120,752"}},{"v":6120751.508954649,"d":"6,120,752"}]
[null,"Tổng cộng",{"$f":"SUM(C12:C18)","v":0},{"$f":"SUM(D12:D18)","v":{"v":128535781.68804762,"d":"128,535,782"}},{"$f":"SUM(E12:E18)","v":{"v":128535781.68804762,"d":"128,535,782"}}]

{"sheet":"Tong hop kinh phi","index":5,"n_rows":20,"n_cols":10,"rows_kept":20}
["BẢNG TỔNG HỢP DỰ TOÁN CÔNG TRÌNH"]
[{"$f":"'Bia1'!D42&'Bia1'!E42","v":"CÔNG TRÌNH: NHÀ BIỆT THỰ GXD"}]
[{"$f":"'Bia1'!D43&'Bia1'!E43","v":"HẠNG MỤC: ĐỔI BẢNG MÃ FONT RẤT ĐƠN GIẢN TRONG DỰ TOÁN GXD"}]
[{"$nulls":6},"ĐVT: đồng",null,"Loại công trình:"]
["STT","NỘI DUNG CHI PHÍ","ĐMTL","CÁCH TÍNH","CHI PHÍ TRƯỚC THUẾ","THUẾ GTGT","CHI PHÍ SAU THUẾ",null,"Số bước thiết kế:"]
[{"$nulls":8},"Cấp công trình:"]
[1,"Chi phí xây dựng (GXD)",null,"(1.1)+(1.2)",{"$f":"E8+E9","v":{"v":99641881.00235769,"d":"99,641,881"}},{"$f":"F8+F9","v":{"v":9964188.10023577,"d":"9,964,188"}},{"$f":"G8+G9","v":{"v":109606069.10259347,"d":"109,606,069"}},null,"Loại báo cáo:",1]
["1.1","Chi phí xây dựng",null,"bảng tính",{"$f":"'TH Hang muc'!C12","v":{"v":98655327.72510663,"d":"98,655,328"}},{"$f":"'TH Hang muc'!D12","v":{"v":9865532.772510663,"d":"9,865,533"}},{"$f":"'TH Hang muc'!E12","v":{"v":108520860.49761729,"d":"108,520,860"}},null,"Lưu ý: Ở dưới có bảng tính chi phí tư vấn và chi phí khác."]
["1.2","Chi phí nhà tạm tại hiện trường để ở và điều hành thi công",null,"bảng tính",{"$f":"G9/1.1","v":{"v":986553.2772510663,"d":"986,553"}},{"$f":"G9-E9","v":{"v":98655.32772510673,"d":"98,655"}},{"$f":"'TH Hang muc'!F12","v":{"v":1085208.604976173,"d":"1,085,209"}}]
[2,"Chi phí thiết bị (GTB)",null,"bảng tính",{"$f":"'TH CP thiet bi'!D13","v":0},{"$f":"'TH CP thiet bi'!E13","v":0},{"$f":"'TH CP thiet bi'!F13","v":0}]
[null,"Chi phí bồi thường, hỗ trợ và tái định cư",null,"bảng tính"]
[3,"Chi phí quản lý dự án (GQLDA)",{"$f":"'QD957'!H12/100","v":{"v":0.02524,"d":"2.524%"}},"ĐMTL*(GXD+GTB)",{"$f":"C12*(E7+E10)","v":{"v":2514961.0764995078,"d":"2,514,961"}},null,{"$f":"E12","v":{"v":2514961.0764995078,"d":"2,514,961"}}]
[4,"Chi phí tư vấn đầu tư xây dựng (GTV)",null,"bảng tính",{"$f":"'CP tu van'!E44","v":{"v":8449000,"d":"8,449,000"}},{"$f":"'CP tu van'!F44","v":{"v":845000,"d":"845,000"}},{"$f":"'CP tu van'!G44","v":{"v":9294000,"d":"9,294,000"}}]
[5,"Chi phí khác (GK)",null,"bảng tính",{"$f":"'Cp khac'!E25","v":{"v":1000000,"d":"1,000,000"}},{"$f":"'Cp khac'!F25","v":0},{"$f":"'Cp khac'!G25","v":{"v":1000000,"d":"1,000,000"}}]
[6,"Chi phí dự phòng (GDP)",null,"GDP1 + GDP2",{"$f":"G15/1.1","v":{"v":5564319.553595135,"d":"5,564,320"}},{"$f":"G15-E15","v":{"v":556431.9553595139,"d":"556,432"}},{"$f":"'CP Du phong'!D45","v":{"v":6120751.508954649,"d":"6,120,752"}}]
[null,"Tổng cộng:",null,"(1)+(2)+(3)+(4)+(5)+(6)",{"$f":"E7+E10+E11+E12+E13+E14+E15","v":{"v":117170161.63245234,"d":"117,170,162"}},{"$f":"F7+F10+F11+F12+F13+F14+F15","v":{"v":11365620.055595282,"d":"11,365,620"}},{"$f":"G7+G10+G11+G12+G13+G14+G15","v":{"v":128535781.68804762,"d":"128,535,782"}}]
[null,"LÀM TRÒN (GXDCT):",null,null,{"$f":"ROUND(E16,-3)","v":{"v":117170000,"d":"117,170,000"}},{"$f":"ROUND(F16,-3)","v":{"v":11366000,"d":"11,366,000"}},{"$f":"E17+F17","v":{"v":128536000,"d":"128,536,000"}}]
[]
[null,"NGƯỜI LẬP",null,null,"NGƯỜI CHỦ TRÌ"]
[{"$nulls":4},"Chứng chỉ KS định giá XD hạng …, số …"]

{"sheet":"TH Hang muc","index":6,"n_rows":14,"n_cols":8,"rows_kept":14}
["TỔNG HỢP DỰ TOÁN CHI PHÍ XÂY DỰNG CÁC HẠNG MỤC"]
[{"$f":"'Bia1'!D42&'Bia1'!E42","v":"CÔNG TRÌNH: NHÀ BIỆT THỰ GXD"}]
[{"$f":"'Bia1'!D43&'Bia1'!E43","v":"HẠNG MỤC: ĐỔI BẢNG MÃ FONT RẤT ĐƠN GIẢN TRONG DỰ TOÁN GXD"}]
[{"$nulls":7},"ĐVT: đồng"]
["STT","HẠNG MỤC","GIÁ TRỊ XÂY DỰNG TRƯỚC THUẾ","THUẾ GTGT","GIÁ TRỊ XÂY DỰNG SAU THUẾ","CHI PHÍ XÂY DỰNG NHÀ TẠM","TỔNG CỘNG","KÝ HIỆU"]
[null,{"$f":"Ts!B6","v":"ĐỔI BẢNG MÃ FONT RẤT ĐƠN GIẢN TRONG DỰ TOÁN GXD"},{"$f":"'CP xay dung'!D21","v":{"v":98655327.72510663,"d":"98,655,328"}},{"$f":"'CP xay dung'!D22","v":{"v":9865532.772510663,"d":"9,865,533"}},{"$f":"'CP xay dung'!D23","v":{"v":108520860.49761729,"d":"108,520,860"}},{"$f":"'CP xay dung'!D24","v":{"v":1085208.604976173,"d":"1,085,209"}},{"$f":"'CP xay dung'!D25","v":{"v":109606069.10259347,"d":"109,606,069"}}]
[{"$nulls":6},{"$f":"SUM(C7:F7)","v":0}]
[{"$nulls":6},0]
[{"$nulls":6},0]
[{"$nulls":6},0]
[{"$nulls":6},0]
[null,"TỔNG CỘNG",{"$f":"SUM(C6:C11)","v":{"v":98655327.72510663,"d":"98,655,328"}},{"$f":"SUM(D6:D11)","v":{"v":9865532.772510663,"d":"9,865,533"}},{"v":108520860.49761729,"d":"108,520,860"},{"v":1085208.604976173,"d":"1,085,209"},{"v":109606069.10259347,"d":"109,606,069"},"Gxd"]
[]
[null,{"$f":"\"(Bằng chữ: \"&vnd(G12)&\")\"","v":"(Bằng chữ: Một trăm linh chín triệu sáu trăm linh sáu nghìn không trăm sáu mươi chín đồng.)"}]

{"sheet":"CP xay dung","index":7,"n_rows":35,"n_cols":7,"rows_kept":35}
["BẢNG TỔNG HỢP DỰ TOÁN CHI PHÍ XÂY DỰNG"]
[{"$f":"'Bia1'!D42&'Bia1'!E42","v":"CÔNG TRÌNH: NHÀ BIỆT THỰ GXD"}]
[{"$f":"'Bia1'!D43&'Bia1'!E43","v":"HẠNG MỤC: ĐỔI BẢNG MÃ FONT RẤT ĐƠN GIẢN TRONG DỰ TOÁN GXD"}]
[{"$nulls":4},"ĐVT: đồng"]
["STT","KHOẢN MỤC CHI PHÍ","CÁCH TÍNH","GIÁ TRỊ","KÝ HIỆU","HS1","HS2"]
[null,"CHI PHÍ THEO ĐƠN GIÁ"]
[null,"Chi phí vật liệu",null,{"$f":"'Dutoan XD'!L100+'Dutoan XD'!M100","v":{"v":74264342.92999999,"d":"74,264,343"}},"A"]
[null,"Chênh lệch vật liệu",null,null,"CLVL"]
[null,"Chi phí nhân công",null,{"$f":"'Dutoan XD'!N100","v":{"v":10015056.649999999,"d":"10,015,057"}},"B"]
[null,"Chênh lệch nhân công",null,null,"CLNC"]
[null,"Chi phí máy xây dựng",null,{"$f":"'Dutoan XD'!O100","v":{"v":1383862.97,"d":"1,383,863"}},"C"]
[null,"Chênh lệch máy xây dựng",null,null,"CLM"]
["I","CHI PHÍ TRỰC TIẾP"]
[1,"Chi phí vật liệu",{"$f":"IF('CP xay dung'!F14=0,\"A+CLVL\",IF('CP xay dung'!D8=0,\"A*\"&'CP xay dung'!F14,\"(A + CLVL) * \"&'CP xay dung'!F14))","v":"A*1"},{"$f":"IF(F14=0,D7+D8,(D7+D8)*F14)","v":{"v":74264342.92999999,"d":"74,264,343"}},"VL",{"$f":"ROUND(Ts!$C$12,3)","v":1}]
[2,"Chi phí nhân công",{"$f":"IF('CP xay dung'!F15=0,\"B+CLNC\",IF('CP xay dung'!$D$10<>0,IF('CP xay dung'!G15<>0,\"B*\"&'CP xay dung'!F15&\"*\"&'CP xay dung'!G15&\"+CLNC\",\"B*\"&'CP xay dung'!F15&\"+CLNC\"),IF('CP xay dung'!G15<>0,\"B*\"&'CP xay dung'!F15&\"*\"&'CP xay dung'!G15,\"B*\"&'CP xay dung'!F15)))","v":"B*1"},{"$f":"IF(F15=0,D9+D10,IF(D10<>0,IF(G15<>0,D9*F15*G15+D10,D9*F15+D10),IF(G15<>0,D9*F15*G15,D9*F15)))","v":{"v":10015056.649999999,"d":"10,015,057"}},"NC",{"$f":"ROUND(Ts!$C$13,3)","v":1}]
[3,"Chi phí máy thi công",{"$f":"IF('CP xay dung'!F16=0,\"C+CLM\",IF('CP xay dung'!$D$12<>0,IF('CP xay dung'!G16<>0,\"C*\"&'CP xay dung'!F16&\"*\"&'CP xay dung'!G16&\"+CLM\",\"C*\"&'CP xay dung'!F16&\"+CLM\"),IF('CP xay dung'!G16<>0,\"C*\"&'CP xay dung'!F16&\"*\"&'CP xay dung'!G16,\"C*\"&'CP xay dung'!F16)))","v":"C*1"},{"$f":"IF($F$16=0,D11+D12,IF(G16<>0,D11*$F$16*G16+D12,D11*$F$16+D12))","v":{"v":1383862.97,"d":"1,383,863"}},"M",{"$f":"ROUND(Ts!$C$14,3)","v":1}]
[4,"Chi phí trực tiếp khác",{"$f":"\"(VL+NC+M)*\"&F17&\"%\"","v":"(VL+NC+M)*2,5%"},{"$f":"(D14+D15+D16)*F17%","v":{"v":2141581.5637499997,"d":"2,141,582"}},"TT",{"$f":"Ts!$C$15","v":2.5}]
[null,"Chi phí trực tiếp","VL+NC+M+TT",{"$f":"SUM(D14:D17)","v":{"v":87804844.11374998,"d":"87,804,844"}},"T"]
["II","CHI PHÍ CHUNG",{"$f":"\"T * \"&F19&\"%\"","v":"T * 6,5%"},{"$f":"D18*F19%","v":{"v":5707314.867393749,"d":"5,707,315"}},"C",{"$f":"Ts!$C$16","v":6.5}]
["III","THU NHẬP CHỊU THUẾ TÍNH TRƯỚC",{"$f":"\"(T+C) * \"&F20&\"%\"","v":"(T+C) * 5,5%"},{"$f":"(D18+D19)*F20%","v":{"v":5143168.743962905,"d":"5,143,169"}},"TL",{"$f":"Ts!$C$17","v":5.5}]
[null,"Chi phí xây dựng trước thuế","T+C+TL",{"$f":"D18+D19+D20","v":{"v":98655327.72510663,"d":"98,655,328"}},"G"]
["IV","THUẾ GIÁ TRỊ GIA TĂNG","G*TGTGT-XD",{"$f":"D21*F22%","v":{"v":9865532.772510663,"d":"9,865,533"}},"GTGT",{"$f":"Ts!$C$18","v":10}]
[null,"Chi phí xây dựng sau thuế","G + GTGT",{"$f":"D21+D22","v":{"v":108520860.49761729,"d":"108,520,860"}},"GXD"]
["V","CHI PHÍ XÂY DỰNG NHÀ TẠM TẠI HIỆN TRƯỜNG ĐỂ Ở VÀ ĐIỀU HÀNH THI CÔNG","G*tỷ lệ*(1+TGTGT-XD)",{"$f":"D23*F24%","v":{"v":1085208.604976173,"d":"1,085,209"}},"GXDNT",{"$f":"Ts!$C$19","v":1}]
[null,"TỔNG CỘNG","GXD + GXDNT",{"$f":"D23+D24","v":{"v":109606069.10259347,"d":"109,606,069"}}]
[null,"LÀM TRÒN",null,{"$f":"ROUND(D25,-3)","v":{"v":109606000,"d":"109,606,000"}}]
[]
[]
[]
[null,"NGƯỜI LẬP","NGƯỜI CHỦ TRÌ"]
[]
[]
[]
[]
[null,null,"Chứng chỉ KS định giá XD hạng …, số …"]

{"sheet":"Dutoan XD","index":8,"n_rows":109,"n_cols":23,"rows_kept":109,"merged":[[4,0,5,0],[4,1,5,1],[4,2,5,2],[4,3,5,3],[4,4,5,4],[4,5,5,5],[4,6,5,6],[4,15,5,15],[4,19,5,19],[4,20,5,20],[4,21,5,21],[4,22,5,22]]}
["BẢNG DỰ TOÁN CHI PHÍ XÂY DỰNG"]
[{"$f":"'Bia1'!D42&'Bia1'!E42","v":"CÔNG TRÌNH: NHÀ BIỆT THỰ GXD"}]
[{"$f":"'Bia1'!D43&'Bia1'!E43","v":"HẠNG MỤC: ĐỔI BẢNG MÃ FONT RẤT ĐƠN GIẢN TRONG DỰ TOÁN GXD"}]
[{"$nulls":14},"ĐVT: đồng"]
["STT","MÃ VỮA","MÃ HIỆU ĐỊNH MỨC","MÃ HIỆU ĐƠN GIÁ","NỘI DUNG CÔNG VIỆC","ĐƠN VỊ","KHỐI LƯỢNG","ĐƠN GIÁ",{"$nulls":3},"THÀNH TIỀN",{"$nulls":3},"SỐ BỘ PHẬN GIỐNG NHAU","KÍCH THƯỚC",null,null,"HỆ SỐ","K.L MỘT BỘ PHẬN","K.L TOÀN BỘ","GHI CHÚ"]
[{"$nulls":7},"VẬT LIỆU","VẬT LIỆU P","NHÂN CÔNG","MÁY","VẬT LIỆU","VẬT LIỆU P","NHÂN CÔNG","MÁY",null,"DÀI","RỘNG","CAO (SÂU)"]
["[1]","[1a]","[1b]","[2]","[3]","[4]","[5]","[6]","[6']","[7]","[8]","[9]=[5]*[6]","[9']=[5]*[6']","[10]=[5]*[7]","[11]=[5]*[8]","[5]","[6]","[6']","[7]","[8]","[9]","[10]","[11]"]
[{"$nulls":4},"PhÇn ®iÖn"]
[null,null,"BA.13302","BA.13302","L¾p ®Æt ®Ìn èng 1,2m - 2 bãng","bộ",{"v":5,"d":"5.000"},{"v":162400,"d":"162,400"},null,{"v":20106,"d":"20,106"},null,{"$f":"G9*H9","v":{"v":812000,"d":"812,000"}},{"$f":"G9*I9","v":0},{"$f":"G9*J9","v":{"v":100530,"d":"100,530"}},{"$f":"G9*K9","v":0}]
[null,null,"BA.13301","BA.13301","L¾p ®Æt ®Ìn èng 1,2m - 1 bãng","bộ",{"v":6,"d":"6.000"},{"v":91800,"d":"91,800"},null,{"v":14242,"d":"14,242"},null,{"$f":"G10*H10","v":{"v":550800,"d":"550,800"}},{"$f":"G10*I10","v":0},{"$f":"G10*J10","v":{"v":85452,"d":"85,452"}},{"$f":"G10*K10","v":0}]
[null,null,"BA.13605","BA.13605","L¾p ®Æt ®Ìn trang trÝ èp trÇn","bộ",{"v":5,"d":"5.000"},{"v":77250,"d":"77,250"},null,{"v":6283,"d":"6,283"},null,{"$f":"G11*H11","v":{"v":386250,"d":"386,250"}},{"$f":"G11*I11","v":0},{"$f":"G11*J11","v":{"v":31415,"d":"31,415"}},{"$f":"G11*K11","v":0}]
[null,null,"BA.13503","BA.13503","L¾p ®Æt ®Ìn chïm trang trÝ phßng kh¸ch","bộ",{"v":1,"d":"1.000"},{"v":900450,"d":"900,450"},null,{"v":12566,"d":"12,566"},null,{"$f":"G12*H12","v":{"v":900450,"d":"900,450"}},{"$f":"G12*I12","v":0},{"$f":"G12*J12","v":{"v":12566,"d":"12,566"}},{"$f":"G12*K12","v":0}]
[null,null,"BA.13602","BA.13602","L¾p ®Æt ®Ìn tranh 11W","bộ",{"v":3,"d":"3.000"},{"v":257500,"d":"257,500"},null,{"v":8377,"d":"8,377"},null,{"$f":"G13*H13","v":{"v":772500,"d":"772,500"}},{"$f":"G13*I13","v":0},{"$f":"G13*J13","v":{"v":25131,"d":"25,131"}},{"$f":"G13*K13","v":0}]
[{"$nulls":3},"TT","§Ìn c©y trang trÝ","bé",{"v":2,"d":"2.000"},{"v":1000000,"d":"1,000,000"},0,0,0,{"$f":"G14*H14","v":{"v":2000000,"d":"2,000,000"}},{"$f":"G14*I14","v":0},{"$f":"G14*J14","v":0},{"$f":"G14*K14","v":0}]
[null,null,"BA.13601","BA.13601","L¾p ®Æt ®Ìn t­êng kiÓu ¸nh s¸ng h¾t","bộ",{"v":9,"d":"9.000"},{"v":103000,"d":"103,000"},null,{"v":7540,"d":"7,540"},null,{"$f":"G15*H15","v":{"v":927000,"d":"927,000"}},{"$f":"G15*I15","v":0},{"$f":"G15*J15","v":{"v":67860,"d":"67,860"}},{"$f":"G15*K15","v":0}]
[null,null,"BA.13604","BA.13604","L¾p ®Æt ®Ìn trang trÝ næi (®Ìn treo th¶ lÖch t©m).","bộ",{"v":1,"d":"1.000"},{"v":51500,"d":"51,500"},null,{"v":5026,"d":"5,026"},null,{"$f":"G16*H16","v":{"v":51500,"d":"51,500"}},{"$f":"G16*I16","v":0},{"$f":"G16*J16","v":{"v":5026,"d":"5,026"}},{"$f":"G16*K16","v":0}]
[null,null,"BA.13605","BA.13605","L¾p ®Æt ®Ìn trang trÝ ©m trÇn (¸nh s¸ng mê).","bộ",{"v":1,"d":"1.000"},{"v":77250,"d":"77,250"},null,{"v":6283,"d":"6,283"},null,{"$f":"G17*H17","v":{"v":77250,"d":"77,250"}},{"$f":"G17*I17","v":0},{"$f":"G17*J17","v":{"v":6283,"d":"6,283"}},{"$f":"G17*K17","v":0}]
[null,null,"BA.13605","BA.13605","L¾p ®Æt ®Ìn trang trÝ ©m trÇn (¸nh s¸ng tr¾ng).","bộ",{"v":5,"d":"5.000"},{"v":77250,"d":"77,250"},null,{"v":6283,"d":"6,283"},null,{"$f":"G18*H18","v":{"v":386250,"d":"386,250"}},{"$f":"G18*I18","v":0},{"$f":"G18*J18","v":{"v":31415,"d":"31,415"}},{"$f":"G18*K18","v":0}]
[null,null,"BA.13604","BA.13604","L¾p ®Æt ®Ìn trang trÝ næi (®Ìn èp cÇu thang)","bộ",{"v":2,"d":"2.000"},{"v":51500,"d":"51,500"},null,{"v":5026,"d":"5,026"},null,{"$f":"G19*H19","v":{"v":103000,"d":"103,000"}},{"$f":"G19*I19","v":0},{"$f":"G19*J19","v":{"v":10052,"d":"10,052"}},{"$f":"G19*K19","v":0}]
[{"$nulls":3},"TT","§Ìn bµn trang trÝ.","bé",{"v":5,"d":"5.000"},{"v":250000,"d":"250,000"},0,0,0,{"$f":"G20*H20","v":{"v":1250000,"d":"1,250,000"}},{"$f":"G20*I20","v":0},{"$f":"G20*J20","v":0},{"$f":"G20*K20","v":0}]
[{"$nulls":3},"TT","Bé hót mïi ë bÕp.","bé",{"v":2,"d":"2.000"},{"v":200000,"d":"200,000"},0,0,0,{"$f":"G21*H21","v":{"v":400000,"d":"400,000"}},{"$f":"G21*I21","v":0},{"$f":"G21*J21","v":0},{"$f":"G21*K21","v":0}]
[null,null,"BA.13604","BA.13604","L¾p ®Æt ®Ìn trang trÝ næi (®Ìn cæng).","bộ",{"v":4,"d":"4.000"},{"v":51500,"d":"51,500"},null,{"v":5026,"d":"5,026"},null,{"$f":"G22*H22","v":{"v":206000,"d":"206,000"}},{"$f":"G22*I22","v":0},{"$f":"G22*J22","v":{"v":20104,"d":"20,104"}},{"$f":"G22*K22","v":0}]
[null,null,"BA.13102","BA.13102","L¾p ®Æt ®Ìn s¸t trÇn cã chôp (èp trÇn hiªn 60 w)","bộ",{"v":4,"d":"4.000"},{"v":60900,"d":"60,900"},null,{"v":6283,"d":"6,283"},null,{"$f":"G23*H23","v":{"v":243600,"d":"243,600"}},{"$f":"G23*I23","v":0},{"$f":"G23*J23","v":{"v":25132,"d":"25,132"}},{"$f":"G23*K23","v":0}]
[null,null,"BA.13604","BA.13604","L¾p ®Æt ®Ìn trang trÝ næi (®Ìn n÷ hoµng).","bộ",{"v":4,"d":"4.000"},{"v":51500,"d":"51,500"},null,{"v":5026,"d":"5,026"},null,{"$f":"G24*H24","v":{"v":206000,"d":"206,000"}},{"$f":"G24*I24","v":0},{"$f":"G24*J24","v":{"v":20104,"d":"20,104"}},{"$f":"G24*K24","v":0}]
[null,null,"BA.18304","BA.18304","L¾p ®Æt c«ng t¾c (c«ng t¸c 2 chiÒu).","cái",{"v":4,"d":"4.000"},{"v":35175,"d":"35,175"},null,{"v":5864,"d":"5,864"},null,{"$f":"G25*H25","v":{"v":140700,"d":"140,700"}},{"$f":"G25*I25","v":0},{"$f":"G25*J25","v":{"v":23456,"d":"23,456"}},{"$f":"G25*K25","v":0}]
[null,null,"BA.18101","BA.18101","L¾p ®Æt c«ng t¾c 1 h¹t (chengli)","cái",{"v":9,"d":"9.000"},{"v":5025,"d":"5,025"},null,{"v":4189,"d":"4,189"},null,{"$f":"G26*H26","v":{"v":45225,"d":"45,225"}},{"$f":"G26*I26","v":0},{"$f":"G26*J26","v":{"v":37701,"d":"37,701"}},{"$f":"G26*K26","v":0}]
[null,null,"BA.18102","BA.18102","L¾p ®Æt c«ng t¾c 2 h¹t (chengli)","cái",{"v":7,"d":"7.000"},{"v":10050,"d":"10,050"},null,{"v":4608,"d":"4,608"},null,{"$f":"G27*H27","v":{"v":70350,"d":"70,350"}},{"$f":"G27*I27","v":0},{"$f":"G27*J27","v":{"v":32256,"d":"32,256"}},{"$f":"G27*K27","v":0}]
[null,null,"BA.18103","BA.18103","L¾p ®Æt c«ng t¾c 3 h¹t (chengli)","cái",{"v":1,"d":"1.000"},{"v":15075,"d":"15,075"},null,{"v":5026,"d":"5,026"},null,{"$f":"G28*H28","v":{"v":15075,"d":"15,075"}},{"$f":"G28*I28","v":0},{"$f":"G28*J28","v":{"v":5026,"d":"5,026"}},{"$f":"G28*K28","v":0}]
[null,null,"BA.18104","BA.18104","L¾p ®Æt c«ng t¾c 4 h¹t (chengli)","cái",{"v":5,"d":"5.000"},{"v":20100,"d":"20,100"},null,{"v":5445,"d":"5,445"},null,{"$f":"G29*H29","v":{"v":100500,"d":"100,500"}},{"$f":"G29*I29","v":0},{"$f":"G29*J29","v":{"v":27225,"d":"27,225"}},{"$f":"G29*K29","v":0}]
[null,null,"BA.18302","BA.18302","L¾p ®Æt c«ng t¾c lo¹i æ c¾m ®«i 1 pha 3 chÊu -©m t­êng.","cái",{"v":31,"d":"31.000"},{"v":45225,"d":"45,225"},null,{"v":4608,"d":"4,608"},null,{"$f":"G30*H30","v":{"v":1401975,"d":"1,401,975"}},{"$f":"G30*I30","v":0},{"$f":"G30*J30","v":{"v":142848,"d":"142,848"}},{"$f":"G30*K30","v":0}]
[null,null,"BA.15413","BA.15413","L¾p ®Æt hép nèi, hép ph©n d©y, hép c«ng t¾c, hép cÇu ch×, hép automat kÝch th­íc 360x250x99.","hộp",{"v":3,"d":"3.000"},{"v":7350,"d":"7,350"},null,{"v":27227,"d":"27,227"},818,{"$f":"G31*H31","v":{"v":22050,"d":"22,050"}},{"$f":"G31*I31","v":0},{"$f":"G31*J31","v":{"v":81681,"d":"81,681"}},{"$f":"G31*K31","v":{"v":2454,"d":"2,454"}}]
[{"$nulls":3},"TT","§iÒu hoµ nhiÖt ®é 9000BTU"," c¸i",{"v":3,"d":"3.000"},{"v":6650000,"d":"6,650,000"},0,0,0,{"$f":"G32*H32","v":{"v":19950000,"d":"19,950,000"}},{"$f":"G32*I32","v":0},{"$f":"G32*J32","v":0},{"$f":"G32*K32","v":0}]
[null,null,"BB.42101","BB.42101","L¾p ®Æt thïng ®un n­íc nãng","bộ",{"v":3,"d":"3.000"},{"v":1238124,"d":"1,238,124"},null,{"v":91314,"d":"91,314"},{"v":4091,"d":"4,091"},{"$f":"G33*H33","v":{"v":3714372,"d":"3,714,372"}},{"$f":"G33*I33","v":0},{"$f":"G33*J33","v":{"v":273942,"d":"273,942"}},{"$f":"G33*K33","v":{"v":12273,"d":"12,273"}}]
[null,null,"BA.19201","BA.19201","L¾p ®Æt aptomat 1P-16A (Vanlock)","cái",{"v":2,"d":"2.000"},{"v":17850,"d":"17,850"},null,{"v":7959,"d":"7,959"},null,{"$f":"G34*H34","v":{"v":35700,"d":"35,700"}},{"$f":"G34*I34","v":0},{"$f":"G34*J34","v":{"v":15918,"d":"15,918"}},{"$f":"G34*K34","v":0}]
[null,null,"BA.19203","BA.19203","L¾p ®Æt aptomat 2P-80A (Hager).","cái",{"v":1,"d":"1.000"},{"v":132600,"d":"132,600"},null,{"v":15917,"d":"15,917"},null,{"$f":"G35*H35","v":{"v":132600,"d":"132,600"}},{"$f":"G35*I35","v":0},{"$f":"G35*J35","v":{"v":15917,"d":"15,917"}},{"$f":"G35*K35","v":0}]
[null,null,"BA.19202","BA.19202","L¾p ®Æt aptomat 2P-50A (Vanlock)","cái",{"v":2,"d":"2.000"},{"v":61800,"d":"61,800"},null,{"v":10472,"d":"10,472"},null,{"$f":"G36*H36","v":{"v":123600,"d":"123,600"}},{"$f":"G36*I36","v":0},{"$f":"G36*J36","v":{"v":20944,"d":"20,944"}},{"$f":"G36*K36","v":0}]
[null,null,"BA.19201","BA.19201","L¾p ®Æt aptomat 2P-25A (Vanlock)","cái",{"v":2,"d":"2.000"},{"v":17850,"d":"17,850"},null,{"v":7959,"d":"7,959"},null,{"$f":"G37*H37","v":{"v":35700,"d":"35,700"}},{"$f":"G37*I37","v":0},{"$f":"G37*J37","v":{"v":15918,"d":"15,918"}},{"$f":"G37*K37","v":0}]
[null,null,"BA.19201","BA.19201","L¾p ®Æt aptomat 2P-20A (Vanlock).","cái",{"v":8,"d":"8.000"},{"v":17850,"d":"17,850"},null,{"v":7959,"d":"7,959"},null,{"$f":"G38*H38","v":{"v":142800,"d":"142,800"}},{"$f":"G38*I38","v":0},{"$f":"G38*J38","v":{"v":63672,"d":"63,672"}},{"$f":"G38*K38","v":0}]
[null,null,"BA.19201","BA.19201","L¾p ®Æt aptomat 2P-16A (Vanlock).","cái",{"v":4,"d":"4.000"},{"v":17850,"d":"17,850"},null,{"v":7959,"d":"7,959"},null,{"$f":"G39*H39","v":{"v":71400,"d":"71,400"}},{"$f":"G39*I39","v":0},{"$f":"G39*J39","v":{"v":31836,"d":"31,836"}},{"$f":"G39*K39","v":0}]
[null,null,"BA.16210","BA.16210","L¾p ®Æt d©y dÉn 2 ruét 2x16mm2 CU/XLPE/PVC","m",{"v":20,"d":"20.000"},{"v":21852,"d":"21,852"},null,{"v":2178,"d":"2,178"},null,{"$f":"G40*H40","v":{"v":437040,"d":"437,040"}},{"$f":"G40*I40","v":0},{"$f":"G40*J40","v":{"v":43560,"d":"43,560"}},{"$f":"G40*K40","v":0}]
[null,null,"BA.16209","BA.16209","L¾p ®Æt d©y dÉn 2 ruét 2x10mm2 ","m",{"v":7,"d":"7.000"},{"v":15812,"d":"15,812"},null,{"v":1885,"d":"1,885"},null,{"$f":"G41*H41","v":{"v":110684,"d":"110,684"}},{"$f":"G41*I41","v":0},{"$f":"G41*J41","v":{"v":13195,"d":"13,195"}},{"$f":"G41*K41","v":0}]
[null,null,"BA.16206","BA.16206","L¾p ®Æt d©y dÉn 2 ruét 2x4mm2","m",{"v":15,"d":"15.000"},{"v":5673,"d":"5,673"},null,{"v":1508,"d":"1,508"},null,{"$f":"G42*H42","v":{"v":85095,"d":"85,095"}},{"$f":"G42*I42","v":0},{"$f":"G42*J42","v":{"v":22620,"d":"22,620"}},{"$f":"G42*K42","v":0}]
[null,null,"BA.16205","BA.16205","L¾p ®Æt d©y dÉn 2 ruét 2x2,5mm2","m",{"v":235,"d":"235.000"},{"v":3887,"d":"3,887"},null,{"v":1466,"d":"1,466"},null,{"$f":"G43*H43","v":{"v":913445,"d":"913,445"}},{"$f":"G43*I43","v":0},{"$f":"G43*J43","v":{"v":344510,"d":"344,510"}},{"$f":"G43*K43","v":0}]
[null,null,"BA.16204","BA.16204","L¾p ®Æt d©y dÉn 2 ruét 2x1,5mm2","m",{"v":441,"d":"441.000"},{"v":2763,"d":"2,763"},null,{"v":1340,"d":"1,340"},null,{"$f":"G44*H44","v":{"v":1218483,"d":"1,218,483"}},{"$f":"G44*I44","v":0},{"$f":"G44*J44","v":{"v":590940,"d":"590,940"}},{"$f":"G44*K44","v":0}]
[null,null,"BA.16113","BA.16113","L¾p ®Æt d©y ®¬n 1x10mm2","m",{"v":5,"d":"5.000"},{"v":6482,"d":"6,482"},null,{"v":1592,"d":"1,592"},null,{"$f":"G45*H45","v":{"v":32410,"d":"32,410"}},{"$f":"G45*I45","v":0},{"$f":"G45*J45","v":{"v":7960,"d":"7,960"}},{"$f":"G45*K45","v":0}]
[null,null,"BA.16111","BA.16111","L¾p ®Æt d©y ®¬n 1x4mm2","m",{"v":15,"d":"15.000"},{"v":2679,"d":"2,679"},null,{"v":1466,"d":"1,466"},null,{"$f":"G46*H46","v":{"v":40185,"d":"40,185"}},{"$f":"G46*I46","v":0},{"$f":"G46*J46","v":{"v":21990,"d":"21,990"}},{"$f":"G46*K46","v":0}]
[null,null,"BA.16107","BA.16107","L¾p ®Æt d©y ®¬n 1x1,5mm2","m",{"v":110,"d":"110.000"},{"v":1303,"d":"1,303"},null,{"v":1257,"d":"1,257"},null,{"$f":"G47*H47","v":{"v":143330,"d":"143,330"}},{"$f":"G47*I47","v":0},{"$f":"G47*J47","v":{"v":138270,"d":"138,270"}},{"$f":"G47*K47","v":0}]
[null,null,"BA.14301","BA.14301","L¾p næi èng nhùa b¶o hé d©y dÉn ®k 16mm","m",{"v":400,"d":"400.000"},{"v":1071,"d":"1,071"},null,{"v":2094,"d":"2,094"},409,{"$f":"G48*H48","v":{"v":428400,"d":"428,400"}},{"$f":"G48*I48","v":0},{"$f":"G48*J48","v":{"v":837600,"d":"837,600"}},{"$f":"G48*K48","v":{"v":163600,"d":"163,600"}}]
[null,null,"BA.14302","BA.14302","L¾p næi èng nhùa b¶o hé d©y dÉn ®k 21mm ","m",{"v":220,"d":"220.000"},{"v":1607,"d":"1,607"},null,{"v":2513,"d":"2,513"},409,{"$f":"G49*H49","v":{"v":353540,"d":"353,540"}},{"$f":"G49*I49","v":0},{"$f":"G49*J49","v":{"v":552860,"d":"552,860"}},{"$f":"G49*K49","v":{"v":89980,"d":"89,980"}}]
[null,null,"BA.14303","BA.14303","L¾p næi èng nhùa b¶o hé d©y dÉn ®k 32mm","m",{"v":20,"d":"20.000"},{"v":2142,"d":"2,142"},null,{"v":2597,"d":"2,597"},491,{"$f":"G50*H50","v":{"v":42840,"d":"42,840"}},{"$f":"G50*I50","v":0},{"$f":"G50*J50","v":{"v":51940,"d":"51,940"}},{"$f":"G50*K50","v":{"v":9820,"d":"9,820"}}]
[null,null,"BA.14303","BA.14303","L¾p næi èng nhùa b¶o hé d©y dÉn ®k 34mm ","m",{"v":16,"d":"16.000"},{"v":2142,"d":"2,142"},null,{"v":2597,"d":"2,597"},491,{"$f":"G51*H51","v":{"v":34272,"d":"34,272"}},{"$f":"G51*I51","v":0},{"$f":"G51*J51","v":{"v":41552,"d":"41,552"}},{"$f":"G51*K51","v":{"v":7856,"d":"7,856"}}]
[null,null,"BA.15406","BA.15406","L¾p ®Æt hép nèi, hép ph©n d©y, hép c«ng t¾c, hép cÇu ch×, hép automat kÝch th­íc <= 100x100mm","hộp",{"v":5,"d":"5.000"},{"v":2100,"d":"2,100"},null,{"v":17593,"d":"17,593"},818,{"$f":"G52*H52","v":{"v":10500,"d":"10,500"}},{"$f":"G52*I52","v":0},{"$f":"G52*J52","v":{"v":87965,"d":"87,965"}},{"$f":"G52*K52","v":{"v":4090,"d":"4,090"}}]
[null,null,"BA.20101","BA.20101","Gia c«ng vµ ®ãng cäc chèng sÐt","cọc",{"v":4,"d":"4.000"},{"v":26250,"d":"26,250"},null,{"v":26389,"d":"26,389"},null,{"$f":"G53*H53","v":{"v":105000,"d":"105,000"}},{"$f":"G53*I53","v":0},{"$f":"G53*J53","v":{"v":105556,"d":"105,556"}},{"$f":"G53*K53","v":0}]
[{"$nulls":3},"TT","Cäc chèng sÐt, 2,5m/cäc","kg",{"v":57.2,"d":"57.200"},{"v":9000,"d":"9,000"},0,0,0,{"$f":"G54*H54","v":{"v":514800,"d":"514,800"}},{"$f":"G54*I54","v":0},{"$f":"G54*J54","v":0},{"$f":"G54*K54","v":0}]
[null,null,"BA.20502","BA.20502","L¾p ®Æt kim thu sÐt chiÒu dµi 1m","cái",{"v":4,"d":"4.000"},{"v":34430,"d":"34,430"},null,{"v":41049,"d":"41,049"},{"v":14907,"d":"14,907"},{"$f":"G55*H55","v":{"v":137720,"d":"137,720"}},{"$f":"G55*I55","v":0},{"$f":"G55*J55","v":{"v":164196,"d":"164,196"}},{"$f":"G55*K55","v":{"v":59628,"d":"59,628"}}]
[null,null,"BA.20402","BA.20402","Gia c«ng kim thu sÐt chiÒu dµi 1m","cái",{"v":4,"d":"4.000"},{"v":25823,"d":"25,823"},null,{"v":12566,"d":"12,566"},{"v":2120,"d":"2,120"},{"$f":"G56*H56","v":{"v":103292,"d":"103,292"}},{"$f":"G56*I56","v":0},{"$f":"G56*J56","v":{"v":50264,"d":"50,264"}},{"$f":"G56*K56","v":{"v":8480,"d":"8,480"}}]
[{"$nulls":3},"TT","BËt liªn kÕt. ","bé",{"v":58,"d":"58.000"},{"v":1000,"d":"1,000"},0,0,0,{"$f":"G57*H57","v":{"v":58000,"d":"58,000"}},{"$f":"G57*I57","v":0},{"$f":"G57*J57","v":0},{"$f":"G57*K57","v":0}]
[{"$nulls":3},"TT","D©y tho¸t sÐt.","m",{"v":11,"d":"11.000"},{"v":6160,"d":"6,160"},0,0,0,{"$f":"G58*H58","v":{"v":67760,"d":"67,760"}},{"$f":"G58*I58","v":0},{"$f":"G58*J58","v":0},{"$f":"G58*K58","v":0}]
[{"$nulls":4},"PhÇn n­íc"]
[null,null,"BB.14302","BB.14302","L¾p ®Æt èng thÐp tr¸ng kÏm ®­êng kÝnh 32mm b»ng m¨ng s«ng, ®o¹n èng dµi 8m","100m",{"v":0.46,"d":"0.460"},{"v":2466809,"d":"2,466,809"},null,{"v":1071051,"d":"1,071,051"},null,{"$f":"G60*H60","v":{"v":1134732.1400000001,"d":"1,134,732"}},{"$f":"G60*I60","v":0},{"$f":"G60*J60","v":{"v":492683.46,"d":"492,683"}},{"$f":"G60*K60","v":0}]
[null,null,"BB.14301","BB.14301","L¾p ®Æt èng thÐp tr¸ng kÏm ®­êng kÝnh 25mm b»ng m¨ng s«ng, ®o¹n èng dµi 8m","100m",{"v":0.32,"d":"0.320"},{"v":1778245,"d":"1,778,245"},null,{"v":911461,"d":"911,461"},null,{"$f":"G61*H61","v":{"v":569038.4,"d":"569,038"}},{"$f":"G61*I61","v":0},{"$f":"G61*J61","v":{"v":291667.52,"d":"291,668"}},{"$f":"G61*K61","v":0}]
[null,null,"BB.14202","BB.14202","L¾p ®Æt èng thÐp kh«ng rØ ®­êng kÝnh 20mm b»ng ph­¬ng ph¸p hµn, ®o¹n èng dµi 6m","100m",{"v":0.4,"d":"0.400"},{"v":1712271,"d":"1,712,271"},null,{"v":977224,"d":"977,224"},{"v":6591,"d":"6,591"},{"$f":"G62*H62","v":{"v":684908.4,"d":"684,908"}},{"$f":"G62*I62","v":0},{"$f":"G62*J62","v":{"v":390889.60000000003,"d":"390,890"}},{"$f":"G62*K62","v":{"v":2636.4,"d":"2,636"}}]
[null,null,"BB.14201","BB.14201","L¾p ®Æt èng thÐp kh«ng rØ ®­êng kÝnh 15mm b»ng ph­¬ng ph¸p hµn, ®o¹n èng dµi 6m","100m",{"v":0.35,"d":"0.350"},{"v":1510351,"d":"1,510,351"},null,{"v":733023,"d":"733,023"},{"v":4394,"d":"4,394"},{"$f":"G63*H63","v":{"v":528622.85,"d":"528,623"}},{"$f":"G63*I63","v":0},{"$f":"G63*J63","v":{"v":256558.05,"d":"256,558"}},{"$f":"G63*K63","v":{"v":1537.8999999999999,"d":"1,538"}}]
[null,null,"BB.24104a","BB.24144","L¾p ®Æt cót thÐp ®­êng kÝnh 32mm b»ng ph­¬ng ph¸p hµn","cái",{"v":10,"d":"10.000"},{"v":10021,"d":"10,021"},null,{"v":7121,"d":"7,121"},{"v":3296,"d":"3,296"},{"$f":"G64*H64","v":{"v":100210,"d":"100,210"}},{"$f":"G64*I64","v":0},{"$f":"G64*J64","v":{"v":71210,"d":"71,210"}},{"$f":"G64*K64","v":{"v":32960,"d":"32,960"}}]
[null,null,"BB.24103a","BB.24143","L¾p ®Æt cót thÐp ®­êng kÝnh 25mm b»ng ph­¬ng ph¸p hµn","cái",{"v":20,"d":"20.000"},{"v":4390,"d":"4,390"},null,{"v":6283,"d":"6,283"},{"v":1977,"d":"1,977"},{"$f":"G65*H65","v":{"v":87800,"d":"87,800"}},{"$f":"G65*I65","v":0},{"$f":"G65*J65","v":{"v":125660,"d":"125,660"}},{"$f":"G65*K65","v":{"v":39540,"d":"39,540"}}]
[null,null,"BB.24102a","BB.24142","L¾p ®Æt cót thÐp ®­êng kÝnh 20mm b»ng ph­¬ng ph¸p hµn","cái",{"v":32,"d":"32.000"},{"v":3825,"d":"3,825"},null,{"v":5026,"d":"5,026"},{"v":1648,"d":"1,648"},{"$f":"G66*H66","v":{"v":122400,"d":"122,400"}},{"$f":"G66*I66","v":0},{"$f":"G66*J66","v":{"v":160832,"d":"160,832"}},{"$f":"G66*K66","v":{"v":52736,"d":"52,736"}}]
[null,null,"BB.24101a","BB.24141","L¾p ®Æt cót thÐp ®­êng kÝnh 15mm b»ng ph­¬ng ph¸p hµn","cái",{"v":38,"d":"38.000"},{"v":3260,"d":"3,260"},null,{"v":3770,"d":"3,770"},{"v":1318,"d":"1,318"},{"$f":"G67*H67","v":{"v":123880,"d":"123,880"}},{"$f":"G67*I67","v":0},{"$f":"G67*J67","v":{"v":143260,"d":"143,260"}},{"$f":"G67*K67","v":{"v":50084,"d":"50,084"}}]
[null,null,"BB.36101","BB.36101","L¾p ®Æt van mÆt bÝch ®­êng kÝnh 40mm","cái",{"v":38,"d":"38.000"},{"v":88709,"d":"88,709"},null,{"v":15754,"d":"15,754"},null,{"$f":"G68*H68","v":{"v":3370942,"d":"3,370,942"}},{"$f":"G68*I68","v":0},{"$f":"G68*J68","v":{"v":598652,"d":"598,652"}},{"$f":"G68*K68","v":0}]
[null,null,"BB.36301","BB.36301","L¾p ®Æt van phao ®iÒu chØnh tèc ®é läc ®­êng kÝnh 25mm","cái",{"v":2,"d":"2.000"},{"v":3059106,"d":"3,059,106"},null,{"v":65265,"d":"65,265"},null,{"$f":"G69*H69","v":{"v":6118212,"d":"6,118,212"}},{"$f":"G69*I69","v":0},{"$f":"G69*J69","v":{"v":130530,"d":"130,530"}},{"$f":"G69*K69","v":0}]
[null,null,"BB.36501","BB.36501","L¾p ®Æt van ®iÖn ®­êng kÝnh 25mm","cái",{"v":2,"d":"2.000"},{"v":155016,"d":"155,016"},null,{"v":128112,"d":"128,112"},{"v":13501,"d":"13,501"},{"$f":"G70*H70","v":{"v":310032,"d":"310,032"}},{"$f":"G70*I70","v":0},{"$f":"G70*J70","v":{"v":256224,"d":"256,224"}},{"$f":"G70*K70","v":{"v":27002,"d":"27,002"}}]
[null,null,"BB.24104","BB.24104","L¾p ®Æt c«n thÐp ®­êng kÝnh 32mm b»ng ph­¬ng ph¸p hµn","cái",{"v":4,"d":"4.000"},{"v":4020,"d":"4,020"},null,{"v":7121,"d":"7,121"},{"v":3296,"d":"3,296"},{"$f":"G71*H71","v":{"v":16080,"d":"16,080"}},{"$f":"G71*I71","v":0},{"$f":"G71*J71","v":{"v":28484,"d":"28,484"}},{"$f":"G71*K71","v":{"v":13184,"d":"13,184"}}]
[null,null,"BB.24103","BB.24103","L¾p ®Æt c«n thÐp ®­êng kÝnh 25mm b»ng ph­¬ng ph¸p hµn","cái",{"v":2,"d":"2.000"},{"v":3390,"d":"3,390"},null,{"v":6283,"d":"6,283"},{"v":1977,"d":"1,977"},{"$f":"G72*H72","v":{"v":6780,"d":"6,780"}},{"$f":"G72*I72","v":0},{"$f":"G72*J72","v":{"v":12566,"d":"12,566"}},{"$f":"G72*K72","v":{"v":3954,"d":"3,954"}}]
[null,null,"BB.19309","BB.19309","L¾p ®Æt èng nhùa PVC ®k 110mm b»ng ph­¬ng ph¸p hµn, ®o¹n èng dµi 6m","100m",{"v":0.35,"d":"0.350"},{"v":3575758,"d":"3,575,758"},null,{"v":1076496,"d":"1,076,496"},{"v":94324,"d":"94,324"},{"$f":"G73*H73","v":{"v":1251515.2999999998,"d":"1,251,515"}},{"$f":"G73*I73","v":0},{"$f":"G73*J73","v":{"v":376773.6,"d":"376,774"}},{"$f":"G73*K73","v":{"v":33013.4,"d":"33,013"}}]
[null,null,"BB.19309","BB.19309","L¾p ®Æt èng nhùa PVC ®k 90mm b»ng ph­¬ng ph¸p hµn, ®o¹n èng dµi 6m","100m",{"v":0.55,"d":"0.550"},{"v":3575758,"d":"3,575,758"},null,{"v":1076496,"d":"1,076,496"},{"v":94324,"d":"94,324"},{"$f":"G74*H74","v":{"v":1966666.9000000001,"d":"1,966,667"}},{"$f":"G74*I74","v":0},{"$f":"G74*J74","v":{"v":592072.8,"d":"592,073"}},{"$f":"G74*K74","v":{"v":51878.200000000004,"d":"51,878"}}]
[null,null,"BB.19307","BB.19307","L¾p ®Æt èng nhùa PVC ®k 76mm b»ng ph­¬ng ph¸p hµn, ®o¹n èng dµi 6m","100m",{"v":0.35,"d":"0.350"},{"v":1955556,"d":"1,955,556"},null,{"v":844442,"d":"844,442"},{"v":65051,"d":"65,051"},{"$f":"G75*H75","v":{"v":684444.6,"d":"684,445"}},{"$f":"G75*I75","v":0},{"$f":"G75*J75","v":{"v":295554.69999999995,"d":"295,555"}},{"$f":"G75*K75","v":{"v":22767.85,"d":"22,768"}}]
[null,null,"BB.19306","BB.19306","L¾p ®Æt èng nhùa PVC ®k 60mm b»ng ph­¬ng ph¸p hµn, ®o¹n èng dµi 6m","100m",{"v":0.18,"d":"0.180"},{"v":1545455,"d":"1,545,455"},null,{"v":831876,"d":"831,876"},{"v":58546,"d":"58,546"},{"$f":"G76*H76","v":{"v":278181.89999999997,"d":"278,182"}},{"$f":"G76*I76","v":0},{"$f":"G76*J76","v":{"v":149737.68,"d":"149,738"}},{"$f":"G76*K76","v":{"v":10538.279999999999,"d":"10,538"}}]
[null,null,"BB.19304","BB.19304","L¾p ®Æt èng nhùa PVC ®k 42mm b»ng ph­¬ng ph¸p hµn, ®o¹n èng dµi 6m","100m",{"v":0.42,"d":"0.420"},{"v":818182,"d":"818,182"},null,{"v":729672,"d":"729,672"},{"v":40657,"d":"40,657"},{"$f":"G77*H77","v":{"v":343636.44,"d":"343,636"}},{"$f":"G77*I77","v":0},{"$f":"G77*J77","v":{"v":306462.24,"d":"306,462"}},{"$f":"G77*K77","v":{"v":17075.94,"d":"17,076"}}]
[null,null,"BB.29229","BB.29229","L¾p ®Æt cót nhùa PVC ®k 110mm b»ng ph­¬ng ph¸p hµn","cái",{"v":4,"d":"4.000"},{"v":38038,"d":"38,038"},null,{"v":6283,"d":"6,283"},{"v":11384,"d":"11,384"},{"$f":"G78*H78","v":{"v":152152,"d":"152,152"}},{"$f":"G78*I78","v":0},{"$f":"G78*J78","v":{"v":25132,"d":"25,132"}},{"$f":"G78*K78","v":{"v":45536,"d":"45,536"}}]
[null,null,"BB.29229","BB.29229","L¾p ®Æt cót nhùa PVC ®k 90 mm b»ng ph­¬ng ph¸p hµn","cái",{"v":18,"d":"18.000"},{"v":38038,"d":"38,038"},null,{"v":6283,"d":"6,283"},{"v":11384,"d":"11,384"},{"$f":"G79*H79","v":{"v":684684,"d":"684,684"}},{"$f":"G79*I79","v":0},{"$f":"G79*J79","v":{"v":113094,"d":"113,094"}},{"$f":"G79*K79","v":{"v":204912,"d":"204,912"}}]
[null,null,"BB.29226","BB.29226","L¾p ®Æt cót nhùa PVC ®k 60mm b»ng ph­¬ng ph¸p hµn","cái",{"v":26,"d":"26.000"},{"v":6006,"d":"6,006"},null,{"v":4608,"d":"4,608"},{"v":6505,"d":"6,505"},{"$f":"G80*H80","v":{"v":156156,"d":"156,156"}},{"$f":"G80*I80","v":0},{"$f":"G80*J80","v":{"v":119808,"d":"119,808"}},{"$f":"G80*K80","v":{"v":169130,"d":"169,130"}}]
[null,null,"BB.29224","BB.29224","L¾p ®Æt cót nhùa PVC ®k 42mm b»ng ph­¬ng ph¸p hµn","cái",{"v":10,"d":"10.000"},{"v":4004,"d":"4,004"},null,{"v":3351,"d":"3,351"},{"v":4879,"d":"4,879"},{"$f":"G81*H81","v":{"v":40040,"d":"40,040"}},{"$f":"G81*I81","v":0},{"$f":"G81*J81","v":{"v":33510,"d":"33,510"}},{"$f":"G81*K81","v":{"v":48790,"d":"48,790"}}]
[null,null,"BB.29229","BB.29229","L¾p ®Æt chÕch nhùa PVC ®k 110mm b»ng ph­¬ng ph¸p hµn","cái",{"v":2,"d":"2.000"},{"v":38038,"d":"38,038"},null,{"v":6283,"d":"6,283"},{"v":11384,"d":"11,384"},{"$f":"G82*H82","v":{"v":76076,"d":"76,076"}},{"$f":"G82*I82","v":0},{"$f":"G82*J82","v":{"v":12566,"d":"12,566"}},{"$f":"G82*K82","v":{"v":22768,"d":"22,768"}}]
[null,null,"BB.29229","BB.29229","L¾p ®Æt cót nhùa PVC ®k 90 mm b»ng ph­¬ng ph¸p hµn","cái",{"v":8,"d":"8.000"},{"v":38038,"d":"38,038"},null,{"v":6283,"d":"6,283"},{"v":11384,"d":"11,384"},{"$f":"G83*H83","v":{"v":304304,"d":"304,304"}},{"$f":"G83*I83","v":0},{"$f":"G83*J83","v":{"v":50264,"d":"50,264"}},{"$f":"G83*K83","v":{"v":91072,"d":"91,072"}}]
[null,null,"BB.29209","BB.29209","L¾p ®Æt c«n nhùa PVC ®k 90mm b»ng ph­¬ng ph¸p hµn","cái",{"v":4,"d":"4.000"},{"v":38038,"d":"38,038"},null,{"v":6283,"d":"6,283"},{"v":11384,"d":"11,384"},{"$f":"G84*H84","v":{"v":152152,"d":"152,152"}},{"$f":"G84*I84","v":0},{"$f":"G84*J84","v":{"v":25132,"d":"25,132"}},{"$f":"G84*K84","v":{"v":45536,"d":"45,536"}}]
[null,null,"BB.29206","BB.29206","L¾p ®Æt c«n nhùa PVC ®k 60mm b»ng ph­¬ng ph¸p hµn","cái",{"v":6,"d":"6.000"},{"v":6006,"d":"6,006"},null,{"v":4608,"d":"4,608"},{"v":6505,"d":"6,505"},{"$f":"G85*H85","v":{"v":36036,"d":"36,036"}},{"$f":"G85*I85","v":0},{"$f":"G85*J85","v":{"v":27648,"d":"27,648"}},{"$f":"G85*K85","v":{"v":39030,"d":"39,030"}}]
[null,null,"BB.42201","BB.42201","L¾p ®Æt phÔu thu D50","cái",{"v":2,"d":"2.000"},{"v":15002,"d":"15,002"},null,{"v":6702,"d":"6,702"},null,{"$f":"G86*H86","v":{"v":30004,"d":"30,004"}},{"$f":"G86*I86","v":0},{"$f":"G86*J86","v":{"v":13404,"d":"13,404"}},{"$f":"G86*K86","v":0}]
[{"$nulls":3},"TT","Tho¸t sµn D76","c¸i",{"v":3,"d":"3.000"},{"v":15000,"d":"15,000"},0,0,0,{"$f":"G87*H87","v":{"v":45000,"d":"45,000"}},{"$f":"G87*I87","v":0},{"$f":"G87*J87","v":0},{"$f":"G87*K87","v":0}]
[{"$nulls":3},"TT","Häng th«ng t¾c","c¸i",{"v":2,"d":"2.000"},{"v":10000,"d":"10,000"},0,0,0,{"$f":"G88*H88","v":{"v":20000,"d":"20,000"}},{"$f":"G88*I88","v":0},{"$f":"G88*J88","v":0},{"$f":"G88*K88","v":0}]
[null,null,"BB.41201","BB.41201","L¾p ®Æt chËu xÝ bÖt inax","bộ",{"v":4,"d":"4.000"},{"v":250025,"d":"250,025"},null,{"v":62831,"d":"62,831"},null,{"$f":"G89*H89","v":{"v":1000100,"d":"1,000,100"}},{"$f":"G89*I89","v":0},{"$f":"G89*J89","v":{"v":251324,"d":"251,324"}},{"$f":"G89*K89","v":0}]
[null,null,"BB.41102","BB.41102","L¾p ®Æt chËu röa 2 vßi, lavabo inax","bộ",{"v":5,"d":"5.000"},{"v":300030,"d":"300,030"},null,{"v":25132,"d":"25,132"},null,{"$f":"G90*H90","v":{"v":1500150,"d":"1,500,150"}},{"$f":"G90*I90","v":0},{"$f":"G90*J90","v":{"v":125660,"d":"125,660"}},{"$f":"G90*K90","v":0}]
[null,null,"BB.41501","BB.41501","L¾p ®Æt vßi röa 1 vßi, vßi lavabo inax","bộ",{"v":5,"d":"5.000"},{"v":25003,"d":"25,003"},null,{"v":7121,"d":"7,121"},null,{"$f":"G91*H91","v":{"v":125015,"d":"125,015"}},{"$f":"G91*I91","v":0},{"$f":"G91*J91","v":{"v":35605,"d":"35,605"}},{"$f":"G91*K91","v":0}]
[null,null,"BB.41401","BB.41401","L¾p ®Æt vßi t¾m 1 vßi + 1 h­¬ng sen","bộ",{"v":2,"d":"2.000"},{"v":90009,"d":"90,009"},null,{"v":8377,"d":"8,377"},null,{"$f":"G92*H92","v":{"v":180018,"d":"180,018"}},{"$f":"G92*I92","v":0},{"$f":"G92*J92","v":{"v":16754,"d":"16,754"}},{"$f":"G92*K92","v":0}]
[null,null,"BB.41104","BB.41104","L¾p ®Æt thuyÒn t¾m kh«ng cã h­¬ng sen","bộ",{"v":2,"d":"2.000"},{"v":1500150,"d":"1,500,150"},null,{"v":67019,"d":"67,019"},null,{"$f":"G93*H93","v":{"v":3000300,"d":"3,000,300"}},{"$f":"G93*I93","v":0},{"$f":"G93*J93","v":{"v":134038,"d":"134,038"}},{"$f":"G93*K93","v":0}]
[{"$nulls":3},"TT","B×nh ®un n­íc nãng nhanh","bé",{"v":1,"d":"1.000"},{"v":1200000,"d":"1,200,000"},0,0,0,{"$f":"G94*H94","v":{"v":1200000,"d":"1,200,000"}},{"$f":"G94*I94","v":0},{"$f":"G94*J94","v":0},{"$f":"G94*K94","v":0}]
[null,null,"BB.41102","BB.41102","L¾p ®Æt chËu röa 2 vßi","bộ",{"v":1,"d":"1.000"},{"v":300030,"d":"300,030"},null,{"v":25132,"d":"25,132"},null,{"$f":"G95*H95","v":{"v":300030,"d":"300,030"}},{"$f":"G95*I95","v":0},{"$f":"G95*J95","v":{"v":25132,"d":"25,132"}},{"$f":"G95*K95","v":0}]
[{"$nulls":3},"TT","KÐt n­íc inox 3000l","c¸i",{"v":1,"d":"1.000"},{"v":6364600,"d":"6,364,600"},0,0,0,{"$f":"G96*H96","v":{"v":6364600,"d":"6,364,600"}},{"$f":"G96*I96","v":0},{"$f":"G96*J96","v":0},{"$f":"G96*K96","v":0}]
[null,null,"BB.42501","BB.42501","L¾p ®Æt vßi röa vÖ sinh","cái",{"v":4,"d":"4.000"},{"v":47000,"d":"47,000"},null,{"v":5445,"d":"5,445"},null,{"$f":"G97*H97","v":{"v":188000,"d":"188,000"}},{"$f":"G97*I97","v":0},{"$f":"G97*J97","v":{"v":21780,"d":"21,780"}},{"$f":"G97*K97","v":0}]
[{"$nulls":3},"TT","M¸y b¬m n­íc, Q=4m3/h, h=25m","c¸i",{"v":1,"d":"1.000"},{"v":900000,"d":"900,000"},0,0,0,{"$f":"G98*H98","v":{"v":900000,"d":"900,000"}},{"$f":"G98*I98","v":0},{"$f":"G98*J98","v":0},{"$f":"G98*K98","v":0}]
[]
[{"$nulls":3},"TC","Cộng",{"$nulls":6},{"$f":"SUM(L9:L99)","v":{"v":74264342.92999999,"d":"74,264,343"}},{"$f":"SUM(M9:M99)","v":0},{"$f":"SUM(N9:N99)","v":{"v":10015056.649999999,"d":"10,015,057"}},{"$f":"SUM(O9:O99)","v":{"v":1383862.97,"d":"1,383,863"}}]
[{"$nulls":11},"A","Ap","B","C"]
[{"$nulls":15},"Người thực hiện đo bóc khối lượng",{"$nulls":4},"Người kiểm tra đo bóc khối lượng"]
[{"$nulls":15},"(ký tên)",{"$nulls":4},"(ký tên)"]
[]
[]
[{"$nulls":20},"Chứng chỉ KS định giá XD hạng ..., số …"]
[]
[{"$nulls":15},"Thủ trưởng đơn vị thực hiện đo bóc khối lượng"]
[{"$nulls":15},"(ký tên và đóng dấu)"]

{"sheet":"Tkthep","index":9,"n_rows":21,"n_cols":27,"rows_kept":21,"hidden":true,"merged":[[4,1,5,1],[4,2,5,2],[4,3,5,3],[4,4,5,4],[4,5,4,6],[4,7,4,8],[4,9,5,9]]}
[null,"BẢNG THỐNG KÊ CỐT THÉP",{"$nulls":9},"ĐK (mm)",6,8,10,12,14,16,18,20,22,24,26,26,28,30,32]
[null,{"$f":"'Bia1'!D42&'Bia1'!E42","v":"CÔNG TRÌNH: NHÀ BIỆT THỰ GXD"},{"$nulls":9},"TL (kg/m)",{"$f":"ROUND(PI()*(M1/1000)^2/4*1*$M$3,3)","v":0.222},0.395,0.617,0.888,1.208,1.578,1.998,2.466,2.984,3.551,4.168,4.168,4.834,5.549,6.313]
[null,{"$f":"'Bia1'!D43&'Bia1'!E43","v":"HẠNG MỤC: ĐỔI BẢNG MÃ FONT RẤT ĐƠN GIẢN TRONG DỰ TOÁN GXD"},{"$nulls":10},7850,"kg/m3"]
[]
[null,"Tên cấu kiện","Số hiệu thanh","Hình dáng và kích thước","Đ.kính\nΦ (mm)","1 cấu kiện",null,"Toàn bộ",null,"Tổng trọng lượng (kg)"]
[{"$nulls":5},"Số thanh","Chiều dài (m)","Số thanh","Chiều dài (m)"]
[]
[null,null,1,null,16,4,6.83,{"$f":"$B$10*F8","v":16},{"$f":"G8*H8","v":109.28},{"$f":"ROUND(HLOOKUP(E8,$M$1:$AR$2,2,0)*I8,0)","v":172}]
[null,"M1",2,null,20,4,8.22,{"$f":"$B$10*F9","v":16},{"$f":"G9*H9","v":131.52},{"$f":"ROUND(HLOOKUP(E9,$M$1:$AR$2,2,0)*I9,0)","v":324}]
[null,{"v":4,"d":"4 CK"},3,null,6,2,8.25,{"$f":"$B$10*F10","v":8},{"v":66,"d":"66.00"},15]
[null,null,4]
[null,null,5]
[null,null,"…"]
[{"$nulls":3},"Tổng cộng",{"v":10,"d":"<=10mm"},{"$nulls":4},{"$f":"SUMIF(E8:E13,\"<11\",J8:J13)","v":15}]
[{"$nulls":4},{"v":18,"d":"<=18mm"},{"$nulls":4},{"$f":"SUM(J8:J13)-J14-J16","v":172}]
[{"$nulls":4},{"v":18,"d":" >18mm"},{"$nulls":4},{"$f":"SUMIF(E8:E13,\">18\",J8:J13)","v":324}]
[]
[]
[]
[]
[null,"Ghi chú: Chèn thêm dòng vào bảng, chép công thức và nhập số liệu để tính trọng lượng thép."]

{"sheet":"Don gia chi tiet","index":10,"n_rows":6,"n_cols":26,"rows_kept":6}
["BẢNG PHÂN TÍCH ĐƠN GIÁ CHI TIẾT",{"$nulls":12},"VL","NC","M","TT","C","TL","GTGT","GXDNT","Cnc","Gpa","Gbc","Gnt","GDP"]
[{"$f":"'Bia1'!D42&'Bia1'!E42","v":"CÔNG TRÌNH: NHÀ BIỆT THỰ GXD"},{"$nulls":12},{"$f":"'CP xay dung'!F14","v":1},{"$f":"'CP xay dung'!F15","v":1},{"$f":"'CP xay dung'!F16","v":1},{"$f":"'CP xay dung'!F17","v":2.5},{"$f":"'CP xay dung'!F19","v":6.5},{"$f":"'CP xay dung'!F20","v":5.5},{"$f":"'CP xay dung'!F22","v":10},{"$f":"'CP xay dung'!F24","v":1},{"$f":"Ts!H26*100","v":51},{"$f":"Ts!C20","v":5},5,5,10]
[{"$f":"'Bia1'!D43&'Bia1'!E43","v":"HẠNG MỤC: ĐỔI BẢNG MÃ FONT RẤT ĐƠN GIẢN TRONG DỰ TOÁN GXD"}]
[{"$nulls":10},"ĐVT: đồng"]
["STT","MÃ VỮA","MÃ HIỆU ĐỊNH MỨC","MÃ HIỆU\nĐƠN GIÁ","MSVT","TÊN CÔNG VIỆC / THÀNH PHẦN HAO PHÍ","ĐƠN VỊ","ĐỊNH MỨC\nHAO PHÍ","ĐƠN GIÁ","HỆ SỐ","THÀNH TIỀN","HAO PHÍ"]
["[1]",null,null,"[2]","[3]","[4]","[5]","[6]","[7]","[8]","[9]","[9']"]

{"sheet":"VLSG XD","index":11,"n_rows":17,"n_cols":9,"rows_kept":17,"hidden":true}
["BẢNG GIÁ TRỊ CHÊNH LỆCH VẬT LIỆU TÍNH VÀO SAU CHI PHÍ XÂY DỰNG TRƯỚC THUẾ"]
[{"$f":"'Bia1'!D42&'Bia1'!E42","v":"CÔNG TRÌNH: NHÀ BIỆT THỰ GXD"}]
[{"$f":"'Bia1'!D43&'Bia1'!E43","v":"HẠNG MỤC: ĐỔI BẢNG MÃ FONT RẤT ĐƠN GIẢN TRONG DỰ TOÁN GXD"}]
[]
["STT","MSVT","TÊN VẬT LIỆU","ĐƠN VỊ","KHỐI LƯỢNG","GIÁ QUY VỀ","GIÁ THỰC TẾ","CHÊNH LỆCH","THÀNH TIỀN"]
["[1]","[2]","[3]","[4]","[5]","[6]","[7]","[8]","[9]"]
{"$rows_empty":8}
["Ghi chú:"]
["Giá trị chênh lệch được tính vào sau giá trị dự toán xây dựng trước thuế trong bảng tổng hợp dự toán chi phí xây dựng (chèn thêm 1 dòng)."]
["Xem thêm Thông tư số 17/2000/TT-BXD của Bộ Xây dựng."]

{"sheet":"Tong hop & Chenh lech","index":12,"n_rows":6,"n_cols":9,"rows_kept":6}
["BẢNG TỔNG HỢP VÀ TÍNH CHÊNH LỆCH VẬT TƯ XÂY DỰNG"]
[{"$f":"'Bia1'!D42&'Bia1'!E42","v":"CÔNG TRÌNH: NHÀ BIỆT THỰ GXD"}]
[{"$f":"'Bia1'!D43&'Bia1'!E43","v":"HẠNG MỤC: ĐỔI BẢNG MÃ FONT RẤT ĐƠN GIẢN TRONG DỰ TOÁN GXD"}]
[{"$nulls":8},"ĐVT: đồng"]
["STT","MSVT","TÊN VẬT TƯ","ĐƠN VỊ","KHỐI LƯỢNG","GIÁ VẬT TƯ GỐC","GIÁ VẬT TƯ TẠI THỜI ĐIỂM LẬP DỰ TOÁN","CHÊNH LỆCH","THÀNH TIỀN"]
["[1]","[2]","[3]","[4]","[5]","[6]","[7]","[8]=[7]-[6]","[9]=[5]*[8]"]

{"sheet":"Gia vat lieu","index":13,"n_rows":7,"n_cols":23,"rows_kept":7,"merged":[[4,0,5,0],[4,1,5,1],[4,2,5,2],[4,3,5,3],[4,4,5,4],[4,5,5,5],[4,6,5,6],[4,7,5,7],[4,8,5,8],[4,9,5,9],[4,10,5,10],[4,11,5,11],[4,12,5,12],[4,19,5,19],[4,20,5,20],[4,21,5,21],[4,22,5,22]]}
["BẢNG TÍNH GIÁ VẬT LIỆU ĐẾN HIỆN TRƯỜNG XÂY DỰNG"]
[{"$f":"'Bia1'!D42&'Bia1'!E42","v":"CÔNG TRÌNH: NHÀ BIỆT THỰ GXD"}]
[{"$f":"'Bia1'!D43&'Bia1'!E43","v":"HẠNG MỤC: ĐỔI BẢNG MÃ FONT RẤT ĐƠN GIẢN TRONG DỰ TOÁN GXD"}]
[{"$nulls":21},"ĐVT: đồng"]
["STT","MSVT","LOẠI VẬT LIỆU","ĐƠN VỊ","KHỐI LƯỢNG","TRỌNG LƯỢNG ĐƠN VỊ","LOẠI ĐƯỜNG","CỰ LY (Km)","GIÁ CƯỚC","HỆ SỐ BẬC HÀNG","HỆ SỐ ĐỔ BEN","CƯỚC TĂNG THÊM","CHI PHÍ VẬN CHUYỂN","CHI PHÍ TRUNG CHUYỂN",{"$nulls":5},"CHI PHÍ BỐC XẾP","GIÁ GỐC\n(GIÁ MUA)","GIÁ ĐẾN HIỆN TRƯỜNG","NGUỒN MUA"]
[null,"MÃ HIỆU",{"$nulls":11},"Bốc xếp","VC bộ khởi điểm","VC bộ 10m tiếp theo","VC phương tiện thô sơ kđiểm","VC phương tiện thô sơ 10m tiếp","Cộng chi phí  trung chuyển"]
["[1]","[2]","[3]","[4]","[5]","[6]","[7]","[8]","[9]","[10]","[11]","[12]","[13]","[14]","[15]","[16]","[17]","[18]","[19]","[20]","[21]","[22]","[23]"]

{"sheet":"Gia vua","index":14,"n_rows":6,"n_cols":8,"rows_kept":6}
["BẢNG PHỤ LỤC VỮA THI CÔNG XÂY DỰNG"]
[{"$f":"'Bia1'!D42&'Bia1'!E42","v":"CÔNG TRÌNH: NHÀ BIỆT THỰ GXD"}]
[{"$f":"'Bia1'!D43&'Bia1'!E43","v":"HẠNG MỤC: ĐỔI BẢNG MÃ FONT RẤT ĐƠN GIẢN TRONG DỰ TOÁN GXD"}]
[{"$nulls":7},"ĐVT: đồng"]
["STT","MÃ VỮA","MSVT","LOẠI VẬT LIỆU","ĐƠN VỊ","ĐỊNH MỨC","ĐƠN GIÁ","THÀNH TIỀN"]
["[1]","[2]","[3]","[4]","[5]","[6]","[7]","[8]=[6]*[7]"]

{"sheet":"Nhan cong","index":15,"n_rows":15,"n_cols":14,"rows_kept":15,"merged":[[6,3,6,4],[7,3,7,4],[8,3,8,4],[11,0,13,0],[11,1,13,1],[11,2,13,2],[11,3,13,3],[11,4,13,4],[11,5,13,5],[11,6,13,6],[11,13,13,13]]}
["BẢNG LƯƠNG NHÂN CÔNG XÂY DỰNG"]
[{"$f":"'Bia1'!D42&'Bia1'!E42","v":"CÔNG TRÌNH: NHÀ BIỆT THỰ GXD"}]
[{"$f":"'Bia1'!D43&'Bia1'!E43","v":"HẠNG MỤC: ĐỔI BẢNG MÃ FONT RẤT ĐƠN GIẢN TRONG DỰ TOÁN GXD"}]
[" - Mức lương tối thiểu chung (LTTC):",{"$nulls":4},{"$f":"LTTC","v":{"v":1050000,"d":"1,050,000"}},"đồng/tháng"]
[" - Mức lương tối thiểu vùng (LTTV):",{"$nulls":4},{"$f":"LTTV","v":{"v":2000000,"d":"2,000,000"}},"đồng/tháng"]
[" - Các khoản phụ cấp theo LTT:"]
[null,"Phụ cấp lưu động:",null,{"$f":"Ts!C24","v":{"v":0.2,"d":"20% LTTC"}},null,{"$f":"$F$4*luudong","v":{"v":210000,"d":"210,000"}},"đồng/tháng"]
[null,"Phụ cấp khu vực:",null,{"$f":"Ts!C28","v":{"v":0,"d":"0% LTTC"}},null,{"$f":"$F$4*khuvuc","v":0},"đồng/tháng"]
[null,"Phụ cấp độc hại:",null,{"$f":"Ts!C30","v":{"v":0,"d":"0% LTTC"}},null,{"$f":"$F$4*dochai","v":0},"đồng/tháng"]
[null,"Tổng các phụ cấp theo LTT:",{"$nulls":3},{"$f":"SUM(F7:F9)","v":{"v":210000,"d":"210,000"}},"đồng/tháng"]
[]
["STT","MSVT","LOẠI NHÂN CÔNG","CẤP BẬC","HỆ SỐ LƯƠNG (HSL)","LƯƠNG CẤP BẬC (LCB=\nHSLxLTTV) (đ/tháng)","TỔNG CÁC KHOẢN PHỤ CẤP THEO LTT","PHỤ CẤP THEO LƯƠNG CẤP BẬC (LCB)",{"$nulls":5},"TỔNG L+PC (đ/công)"]
[{"$nulls":6},"Lưu động","Lương phụ","Khoán trực tiếp","Không ổn định SX","Thu hút","Đặc biệt","Ca đêm"]
[{"$nulls":7},{"$f":"Ts!$C$25","v":{"v":0.12,"d":"12% LCB"}},{"$f":"Ts!$C$26","v":{"v":0.04,"d":"4% LCB"}},{"$f":"Ts!$C$27","v":{"v":0,"d":"0% LCB"}},{"$f":"thuhut","v":{"v":0,"d":"0% LCB"}},{"$f":"Ts!$C$31","v":{"v":0,"d":"0% LCB"}},{"$f":"Ts!$C$32","v":{"v":0,"d":"0% LCB"}}]
["[1]","[2]","[3]","[4]","[5]","[6]","[7]","[8]","[9]","[10]","[11]","[11a]","[11b]","[12]"]

{"sheet":"Gia ca may","index":16,"n_rows":7,"n_cols":40,"rows_kept":7,"merged":[[4,0,5,0],[4,1,5,1],[4,2,5,2],[4,3,5,3],[4,4,4,7],[4,8,5,9],[4,10,5,10],[4,11,5,11],[4,12,5,12],[4,13,5,13],[4,14,5,14],[4,15,5,15],[4,16,5,16],[4,17,5,17],[4,18,5,18],[4,19,4,21],[4,22,5,22],[4,23,5,23],[4,24,5,24],[4,25,5,25],[4,26,5,26],[4,27,5,27],[4,28,5,28],[4,29,5,29],[4,30,5,30],[4,31,5,31],[4,32,5,32]]}
["BẢNG GIÁ CA MÁY VÀ THIẾT BỊ THI CÔNG XÂY DỰNG",{"$nulls":33},"Xăng (đ/lít)","Dầu Diezel (đ/lít)","Điện (đ/kw)","Ma dút (đ/lít)","Dầu hỏa (đ/lít)","Dầu DO (đ/lít)"]
[{"$f":"'Bia1'!D42&'Bia1'!E42","v":"CÔNG TRÌNH: NHÀ BIỆT THỰ GXD"},{"$nulls":32},"GNL GCM đp:",{"$f":"xang","v":{"v":19000,"d":"19,000"}},{"$f":"diezel","v":{"v":18955,"d":"18,955"}},{"$f":"dien","v":{"v":1242,"d":"1,242"}},{"$f":"mazut","v":{"v":13548,"d":"13,548"}},{"$f":"Ts!C38","v":0},{"$f":"Ts!C39","v":0}]
[{"$f":"'Bia1'!D43&'Bia1'!E43","v":"HẠNG MỤC: ĐỔI BẢNG MÃ FONT RẤT ĐƠN GIẢN TRONG DỰ TOÁN GXD"},{"$nulls":32},"GNL GCM ht:",{"$f":"Ts!C42","v":{"v":19909,"d":"19,909"}},{"$f":"Ts!C43","v":{"v":19545,"d":"19,545"}},{"$f":"Ts!C47","v":{"v":2061,"d":"2,061"}},{"$f":"Ts!C44","v":{"v":14548,"d":"14,548"}},{"$f":"Ts!C45","v":0},{"$f":"Ts!C46","v":0}]
[{"$nulls":18},"ĐVT: đồng/ca",{"$nulls":13},"ĐVT: đồng/ca"]
["STT","MSVT","LOẠI MÁY, THIẾT BỊ","SỐ CA/ NĂM","ĐỊNH MỨC KHẤU HAO, SỬA CHỮA, CHI PHÍ KHÁC / NĂM (%/GIÁ TÍNH KH)",{"$nulls":3},"ĐỊNH MỨC TIÊU HAO NHIÊN LIỆU, NĂNG LƯỢNG 1 CA (CNL)",null,"HỆ SỐ NHIÊN LIỆU PHỤ","THÀNH PHẦN CẤP BẬC THỢ ĐIỀU KHIỂN MÁY","NGUYÊN GIÁ (GIÁ TÍNH KHẤU HAO)","CHI PHÍ KHẤU HAO\n(CKH)","CHI PHÍ SỬA CHỮA\n(CSC)","CHI PHÍ NHIÊN LIỆU, NĂNG LƯỢNG\n(CNL)","CHI PHÍ TIỀN LƯƠNG\n(CTL)","CHI PHÍ KHÁC\n(CCPK)","GIÁ CA MÁY\n(CCM)","CHI PHÍ TRONG GCM TẠI THỜI ĐIỂM GỐC",null,null,"CHI PHÍ NHIÊN LIỆU, NĂNG LƯỢNG TẠI THỜI ĐIỂM GỐC","CHI PHÍ TIỀN LƯƠNG TẠI THỜI ĐIỂM GỐC","NGUYÊN GIÁ (GIÁ TÍNH KHẤU HAO) TẠI THỜI ĐIỂM GỐC","NGUYÊN GIÁ (GIÁ TÍNH KHẤU HAO) TẠI THỜI ĐIỂM ĐIỀU CHỈNH","GIÁ CA MÁY GỐC","CHI PHÍ NHIỀN LIỆU, NĂNG LƯỢNG TẠI THỜI ĐIỂM ĐIỀU CHỈNH","CHI PHÍ TIỀN LƯƠNG TẠI THỜI ĐIỂM ĐIỀU CHỈNH","HỆ SỐ ĐIỀU CHỈNH NGUYÊN GIÁ (K1)","HỆ SỐ ĐIỀU CHỈNH CHI PHÍ NHIÊN LIỆU, NĂNG LƯỢNG (K2)","HỆ SỐ ĐIỀU CHỈNH CHI PHÍ TIỀN LƯƠNG (K3)","GIÁ CA MÁY ĐIỀU CHỈNH (CCMĐC)"]
[{"$nulls":4},"Khấu hao","Hệ số thu hồi khi thanh lý","Sửa chữa","CP #",{"$nulls":11},"CP khấu hao","CP sửa chữa","CP khác"]
["[1]","[2]","[3]","[4]","[5]","[6]","[7]","[8]","[9]",null,"[10]","[11]","[12]","[13]","[14]","[15]","[16]","[17]","[18]","[6]","[7]","[8]","[9]","[10]","[11]","[12]","[12]","[13]","[14]","[15]","[16]","[17]","[18]"]

{"sheet":"NhienlieuXD","index":17,"n_rows":14,"n_cols":13,"rows_kept":14,"hidden":true,"merged":[[4,0,5,0],[4,1,5,1],[4,2,5,2],[4,3,5,3],[4,4,5,4]]}
["BẢNG TỔNG HỢP HAO PHÍ NHIÊN LIỆU, NĂNG LƯỢNG PHẦN THI CÔNG XÂY DỰNG"]
[{"$f":"'Bia1'!D42&'Bia1'!E42","v":"CÔNG TRÌNH: NHÀ BIỆT THỰ GXD"}]
[{"$f":"'Bia1'!D43&'Bia1'!E43","v":"HẠNG MỤC: ĐỔI BẢNG MÃ FONT RẤT ĐƠN GIẢN TRONG DỰ TOÁN GXD"}]
[{"$nulls":12},"ĐVT: đồng"]
["STT","MSVT","TÊN MÁY / THIẾT BỊ THI CÔNG","ĐVT","HAO PHÍ CA MÁY","ĐỊNH MỨC TIÊU HAO NHIÊN LIỆU, NĂNG LƯỢNG",{"$nulls":3},"TỔNG HAO PHÍ NHIÊN LIỆU, NĂNG LƯỢNG"]
[{"$nulls":5},"Xăng","Điện","Diezel","Dầu mazut","Xăng","Điện","Diezel","Dầu mazut"]
["[1]","[2]","[3]","[4]","[5]","[6]","[7]","[8]","[9]","[10]","[11]","[12]","[13]"]
[]
[]
[]
[]
[]
[]
["Tổng cộng",{"$nulls":8},{"$f":"SUM(J8:J13)","v":0},{"$f":"SUM(K8:K13)","v":0},{"$f":"SUM(L8:L13)","v":0},{"$f":"SUM(M8:M13)","v":0}]

{"sheet":"Vật tư điều chỉnh xây dựng","index":18,"n_rows":6,"n_cols":9,"rows_kept":6,"hidden":true}
["BẢNG GIÁ TRỊ VẬT TƯ"]
[{"$f":"'Bia1'!D42&'Bia1'!E42","v":"CÔNG TRÌNH: NHÀ BIỆT THỰ GXD"}]
[{"$f":"'Bia1'!D43&'Bia1'!E43","v":"HẠNG MỤC: ĐỔI BẢNG MÃ FONT RẤT ĐƠN GIẢN TRONG DỰ TOÁN GXD"}]
[{"$nulls":6},"Đơn vị tính: VND"]
["STT","MSVT","TÊN VẬT TƯ","ĐƠN VỊ","KHỐI LƯỢNG","ĐƠN GIÁ","THÀNH TIỀN","TỶ TRỌNG CHI PHÍ VL, NC, MTC CT1","TỶ TRỌNG CHI PHÍ LOẠI VL, NC, NHÓM MTC CHỦ YẾU CT1"]
["[1]","[2]","[3]","[4]","[5]","[6]","[7]","[8]","[9]"]

{"sheet":"Số liệu điều chỉnh HĐ xây dựng","index":19,"n_rows":60,"n_cols":6,"rows_kept":60,"hidden":true,"merged":[[2,2,2,4],[3,2,3,4]]}
[null,"BẢNG TỶ TRỌNG CHI PHÍ"]
[]
[null,"STT","NỘI DUNG",null,null,"GIÁ TRỊ"]
[null,"[1]","[2]",null,null,"[3]"]
[null,"I","Vốn đầu tư xây dựng công trình (GXDCT)",null,null,{"$f":"'Tong hop kinh phi'!G16","v":{"v":128535781.68804762,"d":"128,535,782"}}]
[null,1,"Chi phí xây dựng (GXD)",null,null,{"$f":"'Tong hop kinh phi'!G7","v":{"v":109606069.10259347,"d":"109,606,069"}}]
[null,2,"Chi phí thiết bị (GTB)",null,null,{"$f":"SUM(F8:F10)","v":0}]
[null,null," +  Chi phí mua sắm thiết bị (Gmstb)",null,null,{"$f":"'TH CP thiet bi'!F7","v":0}]
[null,null," +  Chi phí đào tạo và chuyển giao công nghệ (Gdtcg)",null,null,{"$f":"'TH CP thiet bi'!F8","v":0}]
[null,null," +  Chi phí lắp đặt thiết bị và thí nghiệm, hiệu chỉnh (Gld)",null,null,{"$f":"'TH CP thiet bi'!F9","v":0}]
[null,3,"Chi phí khác (GCPK)",null,null,{"$f":"F5-F6-F7","v":{"v":18929712.58545415,"d":"18,929,713"}}]
[null,null," +  Chi phí khảo sát xây dựng",null,null,{"$f":"'Tong hop kinh phi'!#REF!","v":{"$error":"#REF!"}}]
[null,null," +  Chi phí thiết kế công trình",null,null,{"$f":"SUM('Tong hop kinh phi'!#REF!)","v":{"$error":"#REF!"}}]
[null,null," +  Chi phí quản lý dự án",null,null,{"$f":"'Tong hop kinh phi'!G12","v":{"v":2514961.0764995078,"d":"2,514,961"}}]
[null,"II","Các tỷ trọng chi phí theo cơ cấu chi phí và yếu tố chi phí"]
[null,1,"Tỷ trọng chi phí xây dựng (PXD)",null,null,{"$f":"IF(ISERROR(F6/$F$5),0,F6/$F$5)","v":{"v":0.8527280704497058,"d":"85.27%"}}]
[null,2,"Tỷ trọng chi phí thiết bị (PTB)",null,null,{"$f":"IF(ISERROR(F7/$F$5),0,F7/$F$5)","v":{"v":0,"d":"0.00%"}}]
[null,null,"Trong đó:"]
[null,null," +  Tỷ trọng chi phí mua sắm thiết bị  (Gmstb)",null,null,{"$f":"IF(ISERROR(F8/$F$7),0,F8/$F$7)","v":{"v":0,"d":"0.00%"}}]
[null,null," +  Tỷ trọng chi phí đào tạo và chuyển giao công nghệ (Gdtcg)",null,null,{"$f":"IF(ISERROR(F9/$F$7),0,F9/$F$7)","v":{"v":0,"d":"0.00%"}}]
[null,null," +  Tỷ trọng chi phí lắp đặt thiết bị và thí nghiệm, hiệu chỉnh (Gld)",null,null,{"$f":"IF(ISERROR(F10/$F$7),0,F10/$F$7)","v":{"v":0,"d":"0.00%"}}]
[null,3,"Tỷ trọng chi phí khác (PCPK)",null,null,{"$f":"IF(ISERROR(F11/$F$5),0,F11/$F$5)","v":{"v":0.14727192955029425,"d":"14.73%"}}]
[null,null,"Trong đó:"]
[null,null," +  Tỷ trọng chi phí khảo sát xây dựng:",null,null,{"$f":"IF(ISERROR(F12/$F$11),0,F12/$F$11)","v":{"v":0,"d":"0.00%"}}]
[null,null," +  Tỷ trọng chi phí thiết kế công trình:",null,null,{"$f":"IF(ISERROR(F13/$F$11),0,F13/$F$11)","v":{"v":0,"d":"0.00%"}}]
[null,null," +  Tỷ trọng chi phí quản lý dự án: ",null,null,{"$f":"IF(ISERROR(F14/$F$11),0,F14/$F$11)","v":{"v":0.13285785851984028,"d":"13.29%"}}]
[]
[]
[]
[null,"BẢNG SỐ LIỆU ĐIỀU CHỈNH HỢP ĐỒNG"]
[null,{"$f":"'Bia1'!D42&'Bia1'!E42","v":"CÔNG TRÌNH: NHÀ BIỆT THỰ GXD"}]
[null,{"$f":"'Bia1'!D43&'Bia1'!E43","v":"HẠNG MỤC: ĐỔI BẢNG MÃ FONT RẤT ĐƠN GIẢN TRONG DỰ TOÁN GXD"}]
[]
[null," - Các yếu tố điều chỉnh"]
[null,null," + Chí phí vật liệu (VL)",null,1]
[null,null," + Chí phí nhân công (NC)",null,1]
[null,null," + Chí phí máy thi công (MTC)",null,1]
[null,null," + Tỷ lệ tạm ứng  của nhà đầu tư (u)",null,0]
[null,null," + Giá hợp đồng (G)",null,0]
[null,null," + Chi phí điều chỉnh (T)",null,{"$f":"E35+E36+E37","v":3}]
[]
[null,"Trường hợp tổng quát"]
[]
[null,"STT","HỆ SỐ CỐ ĐỊNH \na(%)","TỶ TRỌNG NHÂN CÔNG\nb(%)","TỶ TRỌNG MÁY\nc(%)","TỶ TRỌNG VẬT LiỆU\nd(%)"]
[null,1,"a=1-(b+c+d)","b=NC/G","c=MTC/G","d=VL/G"]
[null,2,{"$f":"1-(D46+E46+F46)","v":{"v":1,"d":"100.00%"}},{"$f":"IF(E39=0,0,E36/E39)","v":{"v":0,"d":"0.00%"}},{"$f":"IF(E39=0,0,E37/E39)","v":{"v":0,"d":"0.00%"}},{"$f":"IF(E39=0,0,E35/E39)","v":{"v":0,"d":"0.00%"}}]
[]
[]
[null,"Trường hợp xét đến tỷ lệ tạm ứng hợp đồng của Chủ đầu tư cho nhà thầu"]
[]
[null,"STT","HỆ SỐ CỐ ĐỊNH \na(%)","TỶ TRỌNG NHÂN CÔNG\nb(%)","TỶ TRỌNG MÁY\nc(%)","TỶ TRỌNG VẬT LiỆU\nd(%)"]
[null,1,"a=1-T/G*(1-u)","b=NC/T*(1-a)","c=MTC/T*(1-a)","d=VL/T*(1-a)"]
[null,2,{"$f":"IF(E39=0,0,1-E40/E39*(1-E38))","v":{"v":0,"d":"0.00%"}},{"$f":"E36/E40*(1-C53)","v":{"v":0.3333333333333333,"d":"33.33%"}},{"$f":"E37/E40*(1-C53)","v":{"v":0.3333333333333333,"d":"33.33%"}},{"$f":"E35/E40*(1-C53)","v":{"v":0.3333333333333333,"d":"33.33%"}}]
[]
[]
[null,"Trường hợp xác định trước hệ số cố định"]
[]
[null,"STT","HỆ SỐ CỐ ĐỊNH \na(%)","TỶ TRỌNG NHÂN CÔNG\nb(%)","TỶ TRỌNG MÁY\nc(%)","TỶ TRỌNG VẬT LiỆU\nd(%)"]
[null,1,null,"b=NC/T*(1-a)","c=MTC/T*(1-a)","d=VL/T*(1-a)"]
[null,2,null,{"$f":"E36/E40*(1-C60)","v":{"v":0.3333333333333333,"d":"33.33%"}},{"$f":"E37/E40*(1-C60)","v":{"v":0.3333333333333333,"d":"33.33%"}},{"$f":"E35/E40*(1-C60)","v":{"v":0.3333333333333333,"d":"33.33%"}}]

{"sheet":"Du thau","index":20,"n_rows":6,"n_cols":19,"rows_kept":6}
["BẢNG DỰ TOÁN DỰ THẦU THI CÔNG XÂY DỰNG"]
[{"$f":"'Bia1'!D42&'Bia1'!E42","v":"CÔNG TRÌNH: NHÀ BIỆT THỰ GXD"}]
[{"$f":"'Bia1'!D43&'Bia1'!E43","v":"HẠNG MỤC: ĐỔI BẢNG MÃ FONT RẤT ĐƠN GIẢN TRONG DỰ TOÁN GXD"}]
[]
["STT","MÃ HIỆU","NỘI DUNG CÔNG VIỆC","ĐƠN VỊ","KHỐI LƯỢNG","ĐƠN GIÁ","THÀNH TIỀN","ĐGVL","ĐGVLP","ĐGNC","ĐGM","TT","T","C","TL","G","GTGT","GXDNT","GXD"]
["[1]","[2]","[3]","[4]","[5]","[6]","[7]=[5]*[6]"]

{"sheet":"VCLC XD","index":21,"n_rows":6,"n_cols":5,"rows_kept":6,"hidden":true}
["BẢNG TỔNG HỢP VẬT TƯ XÂY DỰNG VẬN CHUYỂN LÊN CAO"]
[{"$f":"'Bia1'!D42&'Bia1'!E42","v":"CÔNG TRÌNH: NHÀ BIỆT THỰ GXD"}]
[{"$f":"'Bia1'!D43&'Bia1'!E43","v":"HẠNG MỤC: ĐỔI BẢNG MÃ FONT RẤT ĐƠN GIẢN TRONG DỰ TOÁN GXD"}]
[]
["STT","MÃ HIỆU","TÊN VẬT TƯ","ĐƠN VỊ","KHỐI LƯỢNG"]
["[1]","[2]","[3]","[4]","[5]"]

{"sheet":"Gia tri vat tu","index":22,"n_rows":6,"n_cols":7,"rows_kept":6}
["BẢNG GIÁ TRỊ VẬT TƯ THI CÔNG XÂY DỰNG"]
[{"$f":"Ts!B3&Ts!B4","v":"CÔNG TRÌNH: NHÀ BIỆT THỰ GXD"}]
[{"$f":"Ts!B5&Ts!B6","v":"HẠNG MỤC: ĐỔI BẢNG MÃ FONT RẤT ĐƠN GIẢN TRONG DỰ TOÁN GXD"}]
[{"$nulls":6},"ĐVT: đồng"]
["STT","MSVT","TÊN VẬT TƯ","ĐƠN VỊ","KHỐI LƯỢNG","ĐƠN GIÁ","THÀNH TIỀN"]
["[1]","[2]","[3]","[4]","[5]","[6]","[7]=[5]*[6]"]

{"sheet":"TDTC XD","index":23,"n_rows":6,"n_cols":10,"rows_kept":6,"hidden":true,"merged":[[4,0,5,0],[4,1,5,1],[4,2,5,2],[4,3,5,3],[4,4,5,4],[4,5,4,9]]}
["BẢNG TIẾN ĐỘ THI CÔNG XÂY DỰNG"]
[{"$f":"Ts!B3&Ts!B4","v":"CÔNG TRÌNH: NHÀ BIỆT THỰ GXD"}]
[{"$f":"Ts!B5&Ts!B6","v":"HẠNG MỤC: ĐỔI BẢNG MÃ FONT RẤT ĐƠN GIẢN TRONG DỰ TOÁN GXD"}]
[]
["STT","MÃ HIỆU","NỘI DUNG CÔNG VIỆC","ĐƠN VỊ","HAO PHÍ NC","TIẾN ĐỘ THI CÔNG"]
[{"$nulls":5},"T1","T2","T3","T4","T5"]

{"sheet":"CP tu van","index":24,"n_rows":52,"n_cols":7,"rows_kept":52}
["BẢNG TỔNG HỢP CHI PHÍ TƯ VẤN"]
[{"$f":"'Bia1'!D42&'Bia1'!E42","v":"CÔNG TRÌNH: NHÀ BIỆT THỰ GXD"}]
[{"$f":"'Bia1'!D43&'Bia1'!E43","v":"HẠNG MỤC: ĐỔI BẢNG MÃ FONT RẤT ĐƠN GIẢN TRONG DỰ TOÁN GXD"}]
[{"$nulls":6},"ĐVT: đồng"]
["STT","NỘI DUNG CHI PHÍ","ĐMTL","CÁCH TÍNH","CHI PHÍ TRƯỚC THUẾ","THUẾ GTGT","CHI PHÍ SAU THUẾ"]
[]
[{"$f":"IF(B7<>\"\",COUNTA($B$7:B7)-COUNTIF($B$7:B7,\"\"),\"\")","v":1},"Chi phí lập quy hoạch chi tiết 1/500 (trường hợp ở mục 3.2.3 - QĐ 957)",null,"65% mức chi phí lập quy hoạch chi tiết QHĐT",null,{"$f":"E7*10%","v":0},{"$f":"E7+F7","v":0}]
[{"$f":"IF(B8<>\"\",COUNTA($B$7:B8)-COUNTIF($B$7:B8,\"\"),\"\")","v":2},{"$f":"'QD957'!C14","v":"Chi phí lập báo cáo KTKT"},{"$f":"'QD957'!H14/100","v":{"v":0.036000000000000004,"d":"3.600%"}},"ĐMTL*(GXD+GTB)",{"$f":"C8*('Tong hop kinh phi'!E7+'Tong hop kinh phi'!E10)","v":{"v":3587107.7160848775,"d":"3,587,108"}},{"$f":"E8*10%","v":{"v":358710.77160848776,"d":"358,711"}},{"$f":"E8+F8","v":{"v":3945818.487693365,"d":"3,945,818"}}]
[{"$f":"IF(B9<>\"\",COUNTA($B$7:B9)-COUNTIF($B$7:B9,\"\"),\"\")","v":3},"Chi phí khảo sát địa chất",null,"Theo hợp đồng KSĐC",null,{"$f":"E9*10%","v":0},{"$f":"E9+F9","v":0}]
[{"$f":"IF(B10<>\"\",COUNTA($B$7:B10)-COUNTIF($B$7:B10,\"\"),\"\")","v":4},"Chi phí lập nhiệm vụ khảo sát xây dựng",null,"Lập dự toán riêng",null,0,0]
[{"$f":"IF(B11<>\"\",COUNTA($B$7:B11)-COUNTIF($B$7:B11,\"\"),\"\")","v":5},"Chi phí khảo sát xây dựng",null,"Lập dự toán riêng",null,0,0]
[{"$f":"IF(B12<>\"\",COUNTA($B$7:B12)-COUNTIF($B$7:B12,\"\"),\"\")","v":6},"Chi phí giám sát khảo sát xây dựng",null,"Lập dự toán riêng",null,0,0]
[{"$f":"IF(B13<>\"\",COUNTA($B$7:B13)-COUNTIF($B$7:B13,\"\"),\"\")","v":7},"Chi phí thi tuyển, tuyển chọn thiết kế kiến trúc",null,"Lập dự toán riêng",null,0,0]
[{"$f":"IF(B14<>\"\",COUNTA($B$7:B14)-COUNTIF($B$7:B14,\"\"),\"\")","v":""},{"$f":"'QD957'!C16","v":""},{"$f":"'QD957'!H16/100","v":{"v":0,"d":"0.000%"}},"ĐMTL*GXD",{"$f":"C14*'Tong hop kinh phi'!E7","v":0},{"$f":"E14*10%","v":0},{"$f":"E14+F14","v":0}]
[{"$f":"IF(B15<>\"\",COUNTA($B$7:B15)-COUNTIF($B$7:B15,\"\"),\"\")","v":""},{"$f":"'QD957'!C17","v":""},{"$f":"'QD957'!H17/100","v":{"v":0,"d":"0.000%"}},{"$f":"IF(C15<>0,IF(LCT=2,\"60%*TKKT\",\"55%*TKKT\"),\"\")","v":""},{"$f":"C15*'Tong hop kinh phi'!E7","v":0},{"$f":"E15*10%","v":0},{"$f":"E15+F15","v":0}]
[{"$f":"IF(B16<>\"\",COUNTA($B$7:B16)-COUNTIF($B$7:B16,\"\"),\"\")","v":8},"Chi phí đo vẽ hiện trạng (Nếu trong dự án có công trình phải tháo dỡ hoặc sửa chữa)",null,"Lập dự toán riêng",null,0,0]
[{"$f":"IF(B17<>\"\",COUNTA($B$7:B17)-COUNTIF($B$7:B17,\"\"),\"\")","v":9},"Chi phí thẩm tra tính hiệu quả và khả thi của dự án đầu tư",{"$f":"'QD957'!H15/100","v":{"v":0,"d":"0.000%"}},"ĐMTL*(GXD+GTB)",{"$f":"C17*('Tong hop kinh phi'!E7+'Tong hop kinh phi'!E10)","v":0},{"$f":"E17*10%","v":0},{"$f":"E17+F17","v":0}]
[{"$f":"IF(B18<>\"\",COUNTA($B$7:B18)-COUNTIF($B$7:B18,\"\"),\"\")","v":10},"Chi phí thẩm tra thiết kế kỹ thuật, thiết kế bản vẽ thi công",{"$f":"'QD957'!H18/100","v":{"v":2.0599999999999998E-3,"d":"0.206%"}},"ĐMTL*GXD",{"$f":"C18*'Tong hop kinh phi'!E7","v":{"v":205262.27486485682,"d":"205,262"}},{"$f":"E18*10%","v":{"v":20526.227486485684,"d":"20,526"}},{"$f":"E18+F18","v":{"v":225788.5023513425,"d":"225,789"}}]
[{"$f":"IF(B19<>\"\",COUNTA($B$7:B19)-COUNTIF($B$7:B19,\"\"),\"\")","v":11},"Chi phí thẩm tra tổng mức đầu tư",null,"Lập dự toán riêng",null,0,0]
[{"$f":"IF(B20<>\"\",COUNTA($B$7:B20)-COUNTIF($B$7:B20,\"\"),\"\")","v":12},"Chi phí thẩm tra dự toán xây dựng công trình",{"$f":"'QD957'!H19/100","v":{"v":2E-3,"d":"0.200%"}},"ĐMTL*GXD",{"$f":"C20*'Tong hop kinh phi'!E7","v":{"v":199283.7620047154,"d":"199,284"}},{"$f":"E20*10%","v":{"v":19928.37620047154,"d":"19,928"}},{"$f":"E20+F20","v":{"v":219212.13820518693,"d":"219,212"}}]
[{"$f":"IF(B21<>\"\",COUNTA($B$7:B21)-COUNTIF($B$7:B21,\"\"),\"\")","v":13},"Chi phí thẩm định giá thiết bị",null,"HĐ thẩm định giá",null,0,0]
[{"$f":"IF(B22<>\"\",COUNTA($B$7:B22)-COUNTIF($B$7:B22,\"\"),\"\")","v":14},"Chi phí chi phí lập hồ sơ mời thầu, đánh giá hồ sơ dự thầu thi công xây dựng",{"$f":"'QD957'!H20/100","v":{"v":0.00337,"d":"0.337%"}},"ĐMTL*GXD",{"$f":"C22*'Tong hop kinh phi'!E7","v":{"v":335793.13897794543,"d":"335,793"}},{"v":33579.31389779454,"d":"33,579"},{"v":369372.45287573995,"d":"369,372"}]
[{"$f":"IF(B23<>\"\",COUNTA($B$7:B23)-COUNTIF($B$7:B23,\"\"),\"\")","v":15},"Chi phí lập hồ sơ mời thầu, đánh giá hồ sơ dự thầu mua sắm thiết bị",{"$f":"'QD957'!H21/100","v":{"v":0,"d":"0.000%"}},"ĐMTL*GTB",{"$f":"C23*'Tong hop kinh phi'!E10","v":0},0,0]
[{"$f":"IF(B24<>\"\",COUNTA($B$7:B24)-COUNTIF($B$7:B24,\"\"),\"\")","v":16},"Chi phí thẩm tra hồ sơ mời thầu XL",null,"TT",0,0,0]
[{"$f":"IF(B25<>\"\",COUNTA($B$7:B25)-COUNTIF($B$7:B25,\"\"),\"\")","v":17},"Chi phí thẩm tra kết quả lựa chọn nhà thầu XL",{"v":1E-4,"d":"0.010%"},"ĐMTL*GXD",{"$f":"IF('Tong hop kinh phi'!E7=0,0,IF(C25*'Tong hop kinh phi'!E7<1000000,1000000,MIN(50000000,C25*'Tong hop kinh phi'!E7)))","v":{"v":1000000,"d":"1,000,000"}},{"v":100000,"d":"100,000"},{"v":1100000,"d":"1,100,000"}]
[{"$f":"IF(B26<>\"\",COUNTA($B$7:B26)-COUNTIF($B$7:B26,\"\"),\"\")","v":18},"Chi phí thẩm tra hồ sơ mời thầu TB",null,"TT",0,0,0]
[{"$f":"IF(B27<>\"\",COUNTA($B$7:B27)-COUNTIF($B$7:B27,\"\"),\"\")","v":19},"Chi phí thẩm tra kết quả lựa chọn nhà thầu TB",{"v":1E-4,"d":"0.010%"},"ĐMTL*GTB",{"$f":"IF('Tong hop kinh phi'!E10=0,0,IF(C27*'Tong hop kinh phi'!E10<1000000,1000000,MIN(50000000,C27*'Tong hop kinh phi'!E10)))","v":0},0,0]
[{"$f":"IF(B28<>\"\",COUNTA($B$7:B28)-COUNTIF($B$7:B28,\"\"),\"\")","v":20},"Chi phí giám sát thi công xây dựng",{"$f":"'QD957'!H22/100","v":{"v":0.02628,"d":"2.628%"}},"ĐMTL*GXD",{"$f":"C28*'Tong hop kinh phi'!E7","v":{"v":2618588.63274196,"d":"2,618,589"}},{"v":261858.86327419605,"d":"261,859"},{"v":2880447.4960161564,"d":"2,880,447"}]
[{"$f":"IF(B29<>\"\",COUNTA($B$7:B29)-COUNTIF($B$7:B29,\"\"),\"\")","v":21},"Chi phí giám sát lắp đặt thiết bị",{"$f":"'QD957'!H23/100","v":{"v":0,"d":"0.000%"}},"ĐMTL*GTB",{"$f":"C29*'Tong hop kinh phi'!E10","v":0},0,0]
[{"$f":"IF(B30<>\"\",COUNTA($B$7:B30)-COUNTIF($B$7:B30,\"\"),\"\")","v":22},"Chi phí lập báo cáo đánh giá tác động môi trường (ĐTM)",null,"Lập dự toán riêng",null,0,0]
[{"$f":"IF(B31<>\"\",COUNTA($B$7:B31)-COUNTIF($B$7:B31,\"\"),\"\")","v":23},"Chi phí lập định mức xây dựng, đơn giá xây dựng công trình",null,"Lập dự toán riêng",null,0,0]
[{"$f":"IF(B32<>\"\",COUNTA($B$7:B32)-COUNTIF($B$7:B32,\"\"),\"\")","v":24},"Chi phí kiểm soát chi phí xây dựng",null,"Lập dự toán riêng",null,0,0]
[{"$f":"IF(B33<>\"\",COUNTA($B$7:B33)-COUNTIF($B$7:B33,\"\"),\"\")","v":25},"Chi phí quản lý chi phí đầu tư xây dựng: tổng mức đầu tư, dự toán công trình, định mức xây dựng, đơn giá xây dựng công trình, hợp đồng trong hoạt động xây dựng,...",null,"Lập dự toán riêng",null,0,0]
[{"$f":"IF(B34<>\"\",COUNTA($B$7:B34)-COUNTIF($B$7:B34,\"\"),\"\")","v":26},"Chi phí tư vấn quản lý dự án (trường hợp thuê tư vấn)",null,"Lập dự toán riêng",null,0,0]
[{"$f":"IF(B35<>\"\",COUNTA($B$7:B35)-COUNTIF($B$7:B35,\"\"),\"\")","v":27},"Chi phí thí nghiệm chuyên ngành",null,"Lập dự toán riêng",null,0,0]
[{"$f":"IF(B36<>\"\",COUNTA($B$7:B36)-COUNTIF($B$7:B36,\"\"),\"\")","v":28},"Chi phí kiểm tra chất lượng vật liệu, kiểm định chất lượng công trình theo yêu cầu của Chủ đầu tư",null,"Lập dự toán riêng",null,0,0]
[{"$f":"IF(B37<>\"\",COUNTA($B$7:B37)-COUNTIF($B$7:B37,\"\"),\"\")","v":29},"Chi phí kiểm định chất lượng xây dựng",null,"Lập dự toán riêng",0,0,0]
[{"$f":"IF(B38<>\"\",COUNTA($B$7:B38)-COUNTIF($B$7:B38,\"\"),\"\")","v":30},"Chi phí kiểm tra chứng nhận đủ điều kiện bảo đảm an toàn chịu lực và chứng nhận sự phù hợp về chất lượng công trình",null,"Lập dự toán riêng",0,0,0]
[{"$f":"IF(B39<>\"\",COUNTA($B$7:B39)-COUNTIF($B$7:B39,\"\"),\"\")","v":31},"Chi phí giám sát, đánh giá dự án đầu tư xây dựng công trình","20%*GQLDA","Thông tư 22/2010/TT-BKH ngày 02/12/2010",{"$f":"20%*'Tong hop kinh phi'!E12","v":{"v":502992.21529990155,"d":"502,992"}},{"v":50299.22152999016,"d":"50,299"},{"v":553291.4368298918,"d":"553,291"}]
[{"$f":"IF(B40<>\"\",COUNTA($B$7:B40)-COUNTIF($B$7:B40,\"\"),\"\")","v":32},"Chi phí giám định tư pháp trong xây dựng",null,"Lập dự toán riêng",null,0,0]
[{"$f":"IF(B41<>\"\",COUNTA($B$7:B41)-COUNTIF($B$7:B41,\"\"),\"\")","v":33},"Chi phí quy đổi vốn đầu tư xây dựng công trình tại thời điểm bàn giao, đưa vào khai thác sử dụng",null,"Lập dự toán riêng",null,0,0]
[{"$f":"IF(B42<>\"\",COUNTA($B$7:B42)-COUNTIF($B$7:B42,\"\"),\"\")","v":34},"Chi phí thực hiện các công việc tư vấn khác",null,"Lập dự toán riêng",null,0,0]
[null,"Tổng cộng:",null,null,{"$f":"SUM(E7:E42)","v":{"v":8449027.739974257,"d":"8,449,028"}},{"$f":"SUM(F7:F42)","v":{"v":844902.7739974257,"d":"844,903"}},{"$f":"SUM(G7:G42)","v":{"v":9293930.513971683,"d":"9,293,931"}}]
[null,"LÀM TRÒN (GTV)",null,null,{"$f":"ROUND(E43,-3)","v":{"v":8449000,"d":"8,449,000"}},{"$f":"ROUND(F43,-3)","v":{"v":845000,"d":"845,000"}},{"$f":"ROUND(G43,-3)","v":{"v":9294000,"d":"9,294,000"}}]
[]
[]
["Ghi chú:"]
[" - Bảng tổng hợp chi phí tư vấn liệt kê các khác đầu mục chi phí có thể có."]
[" - Tùy vào điều kiện cụ thể của công trình bạn xóa bớt hoặc chèn thêm dòng để bổ sung các khoản chi phí cho phù hợp."]
[" - Bảng Tổng hợp chi phí tư vấn và chi phí khác trên đây được kê ra các khoản mục chi phí bao gồm cả việc xác định trong TMĐT, khi lập dự toán hay tổng dự toán phải lược bỏ các khoản chi phí cho phù hợp."]
["Ví dụ:"]
["Nếu tính Chi phí lập dự án đầu tư xây dựng công trình thì xóa dòng Chi phí lập báo cáo kinh tế - kỹ thuật."]

{"sheet":"Cp khac","index":25,"n_rows":31,"n_cols":10,"rows_kept":31,"merged":[[3,9,3,10]]}
["BẢNG TỔNG HỢP CHI PHÍ KHÁC"]
[{"$f":"'Bia1'!D42&'Bia1'!E42","v":"CÔNG TRÌNH: NHÀ BIỆT THỰ GXD"}]
[{"$f":"'Bia1'!D43&'Bia1'!E43","v":"HẠNG MỤC: ĐỔI BẢNG MÃ FONT RẤT ĐƠN GIẢN TRONG DỰ TOÁN GXD"}]
[{"$nulls":6},"ĐVT: đồng",null,"TMĐT",{"$f":"TMDT","v":{"v":0,"d":"0 đồng"}}]
["STT","NỘI DUNG CHI PHÍ","ĐMTL","CÁCH TÍNH","CHI PHÍ TRƯỚC THUẾ","THUẾ GTGT","CHI PHÍ SAU THUẾ"]
[]
[1,"Chi phí rà phá bom mìn, vật nổ",null,"Lập dự toán riêng",null,{"$f":"E7*10%","v":0},{"$f":"E7+F7","v":0}]
[2,"Chi phí bảo hiểm công trình",null,"ĐMTL*(GXD+GTB)",{"$f":"C8*('Tong hop kinh phi'!E7+'Tong hop kinh phi'!E10)","v":0},0,{"$f":"E8+F8","v":0}]
[3,"Chi phí bảo hiểm tư vấn",null,"Lập dự toán riêng",null,0,{"$f":"E9+F9","v":0}]
[4,"Chi phí di chuyển thiết bị thi công và lực lượng lao động đến công trường",null,"Lập dự toán riêng",null,0,0]
[5,"Chi phí đăng kiểm chất lượng quốc tế, quan trắc biến dạng công trình",null,"Lập dự toán riêng",null,0,0]
[6,"Chi phí đảm bảo an toàn giao thông phục vụ thi công các công trình",null,"Lập dự toán riêng",null,0,0]
[7,"Chi phí hoàn trả hạ tầng kỹ thuật bị ảnh hưởng khi thi công công trình",null,"Lập dự toán riêng",null,0,0]
[8,"Chi phí kiểm toán",{"$f":"'QD957'!H28/100","v":{"v":0.0064,"d":"0.640%"}},"ĐMTL*TMĐT",{"$f":"C14*$J$4","v":0},{"$f":"E14*10%","v":0},0]
[9,"Chi phí nghiên cứu khoa học công nghệ liên quan đến dự án",null,"Lập dự toán riêng",null,{"$f":"E15*10%","v":0},0]
[10,"Vốn lưu động ban đầu (đối với các dự án đầu tư xây dựng nhằm mục đích kinh doanh)",null,"Lập dự toán riêng",null,null,0]
[11,"Lãi vay trong thời gian xây dựng",null,"Lập dự toán riêng",null,null,0]
[12,"Chi phí cho quá trình chạy thử không tải và có tải theo quy trình công nghệ",null,"Lập dự toán riêng",null,{"$f":"E18*10%","v":0},0]
[13,"Chi phí thẩm tra phê duyệt quyết toán vốn đầu tư",{"$f":"'QD957'!H29/100","v":{"v":3.8E-3,"d":"0.380%"}},"ĐMTL*TMĐT",{"$f":"C19*$J$4","v":0},null,0]
[14,"Phí thẩm định dự án đầu tư",{"$f":"'QD957'!H27/100","v":{"v":1.8999999999999998E-4,"d":"0.019%"}},"ĐMTL*TMĐT",{"$f":"C20*$J$4","v":0},null,0]
[15,"Chi phí thẩm định kết quả lựa chọn nhà thầu xây dựng",{"v":1E-4,"d":"0.010%"},"ĐMTL*GXD",{"$f":"IF('Tong hop kinh phi'!E7=0,0,IF(C21*'Tong hop kinh phi'!E7<1000000,1000000,MIN(50000000,C21*'Tong hop kinh phi'!E7)))","v":{"v":1000000,"d":"1,000,000"}},null,{"v":1000000,"d":"1,000,000"}]
[16,"Chi phí thẩm định kết quả lựa chọn nhà thầu cung cấp, lắp đặt thiết bị",{"v":1E-4,"d":"0.010%"},"ĐMTL*GTB",{"$f":"IF('Tong hop kinh phi'!E10=0,0,IF(C22*'Tong hop kinh phi'!E10<1000000,1000000,MIN(50000000,C22*'Tong hop kinh phi'!E10)))","v":0},null,0]
[17,"Lệ phí cấp phép xây dựng",null,"Theo quy định",null,null,0]
[null,"Tổng cộng:",null,null,{"$f":"SUM(E7:E23)","v":{"v":1000000,"d":"1,000,000"}},{"$f":"SUM(F7:F23)","v":0},{"$f":"SUM(G7:G23)","v":{"v":1000000,"d":"1,000,000"}}]
[null,"LÀM TRÒN (GK)",null,null,{"$f":"ROUND(E24,-3)","v":{"v":1000000,"d":"1,000,000"}},{"$f":"ROUND(F24,-3)","v":0},{"$f":"ROUND(G24,-3)","v":{"v":1000000,"d":"1,000,000"}}]
[]
[]
["Ghi chú:"]
[" - Bảng tổng hợp chi phí khác liệt kê các khác đầu mục chi phí có thể có."]
[" - Tùy vào điều kiện cụ thể của công trình bạn xóa bớt hoặc chèn thêm dòng để bổ sung thêm các khoản chi phí cho phù hợp."]
[" - Bảng Tổng hợp chi phí khác trên được kê ra các khoản mục chi phí bao gồm cả việc xác định trong TMĐT, khi lập dự toán hay tổng dự toán phải lược bỏ các khoản chi phí cho phù hợp."]

{"sheet":"CP Du phong","index":26,"n_rows":50,"n_cols":7,"rows_kept":50,"merged":[[23,0,24,0],[23,1,24,1],[29,0,30,0],[29,1,30,1],[37,0,38,0],[37,1,38,1],[44,3,44,4]]}
["BẢNG CHI PHÍ DỰ PHÒNG CHO YẾU TỐ TRƯỢT GIÁ"]
[{"$f":"'Bia1'!D42&'Bia1'!E42","v":"CÔNG TRÌNH: NHÀ BIỆT THỰ GXD"}]
[{"$f":"'Bia1'!D43&'Bia1'!E43","v":"HẠNG MỤC: ĐỔI BẢNG MÃ FONT RẤT ĐƠN GIẢN TRONG DỰ TOÁN GXD"}]
[null,"Chi phí xây dựng (GXD):",{"$f":"'Tong hop kinh phi'!G7","v":{"v":109606069.10259347,"d":"109,606,069"}}]
[null,"Chi phí thiết bị (GTB):",{"$f":"'Tong hop kinh phi'!G10","v":0}]
[null,"Chi phí quản lý dự án (GQLDA):",{"$f":"'Tong hop kinh phi'!G12","v":{"v":2514961.0764995078,"d":"2,514,961"}}]
[null,"Chi phí tư vấn đầu tư xây dựng (GTV):",{"$f":"'Tong hop kinh phi'!G13","v":{"v":9294000,"d":"9,294,000"}}]
[null,"Chi phí khác (GK):",{"$f":"'Tong hop kinh phi'!G14","v":{"v":1000000,"d":"1,000,000"}}]
[null,"Tổng chi phí dự kiến thực hiện ở năm t (Vt)",{"$f":"SUM(C4:C8)","v":{"v":122415030.17909297,"d":"122,415,030"}}]
[]
["I. Dự phòng cho khối lượng công việc phát sinh (Gdp1)"]
[{"$nulls":3},"Kps =",{"v":0.05,"d":"5%"}]
[null,"GDP1 =",{"$f":"$E$12*(C4+C5+C6+C7+C8)","v":6120751.508954649}]
["II. Dự phòng cho yếu tố trượt giá (Gdp2)"]
[]
[]
["T: Độ dài thời gian thi công xây dựng công trình (năm);"]
["t: Số thứ tự năm phân bổ vốn thực hiện dự án (t=1÷T);"]
["Vt: Vốn đầu tư dự kiến thực hiện trong năm thứ t;"]
["IXDCTbq: Mức độ trượt giá bình quân tính;"]
["DIXDCTbq: Mức dự báo biến động của các yếu tố chi phí, giá cả.",null,{"v":0,"d":"0%"}]
[]
["BẢNG 1: PHÂN BỔ VỐN ĐẦU TƯ THEO TIẾN ĐỘ THỰC HIỆN"]
["STT","Nội dung","Tiến độ thực hiện (năm)"]
[null,null,1,2,3,4,5]
[1,"Mức phân bổ vốn từng năm (%)"]
[2,"Vốn phân bổ (tỷ đồng)",{"$f":"C26*$C$9","v":0},{"$f":"D26*$C$9","v":0},{"$f":"E26*$C$9","v":0},{"$f":"F26*$C$9","v":0},{"$f":"G26*$C$9","v":0}]
[]
["BẢNG 2 TÍNH MỨC ĐỘ TRƯỢT GIÁ BÌNH QUÂN"]
["STT","Chỉ tiêu","Tiến độ thực hiện (năm)"]
[null,null,1,2,3,4,5]
[1,"Chỉ số giá xây dựng (theo công bố của Bộ Xây dựng)",139,144,149,175,254]
[2,"Hệ số trượt giá (chỉ số giá năm đó chia cho chỉ số giá năm liền trước)",null,{"$f":"D32/C32","v":{"v":1.0359712230215827,"d":"1.036"}},{"$f":"E32/D32","v":{"v":1.0347222222222223,"d":"1.035"}},{"$f":"F32/E32","v":{"v":1.174496644295302,"d":"1.174"}},{"$f":"G32/F32","v":{"v":1.4514285714285715,"d":"1.451"}}]
[3,"Mức độ trượt giá từng năm",null,{"$f":"D33-1","v":{"v":0.03597122302158273,"d":"0.036"}},{"$f":"E33-1","v":{"v":0.03472222222222232,"d":"0.035"}},{"$f":"F33-1","v":{"v":0.17449664429530198,"d":"0.174"}},{"$f":"G33-1","v":{"v":0.4514285714285715,"d":"0.451"}}]
[4,"Mức độ trượt giá trung bình hàng năm IXDbq",{"$nulls":4},{"$f":"ROUND(AVERAGE(D34:G34),G31-1)","v":{"v":0.1742,"d":"0.174"}}]
[]
["BẢNG 3: TÍNH CHI PHÍ DỰ PHÒNG CHO YẾU TỐ TRƯỢT GIÁ"]
["STT","Nội dung","Tiến độ thực hiện (năm)"]
[null,null,1,2,3,4,5]
[1,"Chi phí thực hiện dự án theo tiến độ chưa có trượt giá (tỷ đồng)",{"$f":"C27","v":0},{"$f":"D27","v":0},{"$f":"E27","v":0},{"$f":"F27","v":0},{"$f":"G27","v":0}]
[3,"Chi phí thực hiện dự án theo tiến độ đã có trượt giá",{"$f":"C40*(1+$G$35+$C$21)^C39","v":0},{"$f":"D40*(1+$G$35+$C$21)^D39","v":0},{"$f":"E40*(1+$G$35+$C$21)^E39","v":0},{"$f":"F40*(1+$G$35+$C$21)^F39","v":0},{"$f":"G40*(1+$G$35+$C$21)^G39","v":0}]
[4,"Trượt giá từng năm",{"$f":"C41-C40","v":0},{"$f":"D41-D40","v":0},{"$f":"E41-E40","v":0},{"$f":"F41-F40","v":0},{"$f":"G41-G40","v":0}]
[5,"Trượt giá tích luỹ (GDP2)",{"$f":"C42","v":0},{"$f":"C43+D42","v":0},{"$f":"D43+E42","v":0},{"$f":"E43+F42","v":0},{"$f":"F43+G42","v":0}]
[]
[null,null,"GDP = GDP1 + GDP2 =",{"$f":"C13+G43","v":{"v":6120751.508954649,"d":"6,120,752 đồng"}}]
[null,null,"Tỷ lệ % dự phòng phí:",{"$f":"IF(ISERROR(D45/C9),\"\",D45/C9)","v":{"v":0.05,"d":"5%"}}]
[]
["Ghi chú:"]
[" - Điều chỉnh lại công thức khi tiến độ thực hiện thi công xây dựng công trình khác đi."]
[" - Kích chuột vào các ô bôi màu để xem hướng dẫn."]

{"sheet":"QD957","index":27,"n_rows":248,"n_cols":40,"rows_kept":248,"merged":[[1,3,1,4],[2,3,2,4],[3,3,3,4],[13,28,13,39],[138,28,138,39],[215,26,215,38],[216,27,217,27],[224,28,224,38]]}
[null,"BẢNG TÍNH NỘI SUY CÁC ĐỊNH MỨC TỶ LỆ",{"$nulls":24},"Bảng số 1: Định mức chi phí quản lý dự án"]
[null,null,"Chi phí XD trước thuế (GXDTT): ",{"$f":"'Tong hop kinh phi'!E7","v":{"v":99641881.00235769,"d":"99,641,881 đồng"}}]
[null,null,"Chi phí TB trước thuế (GTBTT):",{"$f":"'Tong hop kinh phi'!E10","v":{"v":0,"d":"0 đồng"}},{"$nulls":35},"Đơn vị tính: Tỷ lệ %"]
[null,null,"Tổng mức đầu tư (TMĐT)",{"$nulls":23},"TT","Loại công trình","Chi phí xây dựng và thiết bị (chưa có thuế GTGT) (tỷ đồng)"]
[null,null,"Loại công trình:",1,{"$nulls":24},{"v":10,"d":"<=10"},20,50,100,200,500,{"v":1000,"d":"1,000"},{"v":2000,"d":"2,000"},{"v":5000,"d":"5,000"},{"v":10000,"d":"10,000"},{"v":20000,"d":"20,000"},{"v":30000,"d":"30,000"}]
[null,null,"Số bước thiết kế:",1,null,{"$f":"IF(D6=1,\"Chi phí lập BCKTKT gồm cả chi phí thiết kế\",IF(OR(AND(BTK=3,D8=2),AND(BTK=2,D8=2)),\"Không thể thiết kế 2 hoặc 3 bước với Báo cáo kinh tế kỹ thuật\",\"\"))","v":"Chi phí lập BCKTKT gồm cả chi phí thiết kế"},{"$nulls":20},1,"Công trình dân dụng",2.524,2.141,1.912,1.537,1.436,1.254,1.026,0.793,0.589,0.442,{"v":0.33,"d":"0.330"},0.264]
[null,null,"Cấp công trình:",5,{"$nulls":22},2,"Công trình công nghiệp",2.657,2.254,2.013,1.617,1.512,{"v":1.32,"d":"1.320"},{"v":1.08,"d":"1.080"},0.931,{"v":0.62,"d":"0.620"},0.465,0.347,0.278]
[null,null,"Loại báo cáo:",{"$f":"IF(BTK=1,2,1)","v":2},null,{"$f":"IF(AND(D6=D8,D6=1),\"Lập dự án đầu tư thì không thể thiết 1 bước\",IF(D2+D3=0,\"\",IF(AND(D8=1,(D2+D3)<15000000000),\"Công trình dưới 15 tỷ phải lập DAĐT sao?\",IF(AND(D8=2,(D2+D3)>=15000000000),\"Công trình từ 15 tỷ trở lên phải lập DAĐT\",\"\"))))","v":""},{"$nulls":20},3,"Công trình giao thông",2.259,1.916,1.711,1.375,1.285,1.122,0.918,0.791,0.527,0.395,0.295,0.236]
[{"$nulls":26},4,"Công trình thuỷ lợi",2.391,2.029,1.811,1.455,1.361,1.188,0.972,0.838,0.558,0.419,0.313,{"v":0.25,"d":"0.250"}]
[null,"TT","LOẠI CHI PHÍ","Ga","Gb","Na","Nb","ĐMTL (%)",{"$nulls":18},5,"Công trình hạ tầng kỹ thuật",2.125,1.803,{"v":1.61,"d":"1.610"},1.294,{"v":1.21,"d":"1.210"},1.056,0.864,0.744,0.496,0.372,0.278,0.222]
[null,"I","CHI PHÍ QUẢN LÝ DỰ ÁN (QĐ 957)"]
[null,1,"Chi phí quản lý dự án",{"$f":"IF(XDTT+TBTT<=AC5,AC5,OFFSET(AC5,0,J12-1))","v":10},{"$f":"OFFSET(AC5,0,K12-1)","v":10},{"$f":"IF(D12=E12,OFFSET(AC5,LCT,K12-1),OFFSET(AC5,LCT,J12-1))","v":{"v":2.524,"d":"2.5240"}},{"$f":"OFFSET(AC5,LCT,K12-1)","v":{"v":2.524,"d":"2.5240"}},{"$f":"ROUND(IF(D12=E12,OFFSET(AC5,LCT,K12-1),FORECAST(XDTT+TBTT,F12:G12,D12:E12)),3)","v":2.524},null,{"$f":"IF(XDTT+TBTT>AN5,K12,K12+1)","v":2},{"$f":"IF(XDTT+TBTT<=AC5,1,MATCH(XDTT+TBTT,AC5:AN5,1))","v":1},{"$nulls":15},"Bảng số 2: Định mức chi phí lập dự án đầu tư"]
[null,"II","CHI PHÍ TƯ VẤN ĐẦU TƯ XÂY DỰNG CÔNG TRÌNH (QĐ 957)",{"$nulls":36},"Đơn vị tính: Tỷ lệ %"]
[null,{"$f":"IF(C14<>\"\",COUNTA($C$14:C14)-COUNTIF($C$14:C14,\"\"),\"\")","v":1},{"$f":"IF(D8=1,\"Chi phí lập dự án đầu tư xây dựng công trình\",\"Chi phí lập báo cáo KTKT\")","v":"Chi phí lập báo cáo KTKT"},{"$f":"IF(D8=1,IF(XDTT+TBTT<=AC15,AC15,OFFSET(AC15,0,J14-1)),IF(XDTT+TBTT<=AC25,AC25,OFFSET(AC25,0,L14-1)))","v":3},{"$f":"IF(D8=1,OFFSET(AC15,0,K14-1),OFFSET(AC25,0,K14-1))","v":3},{"$f":"IF(D8=1,IF(D14=E14,OFFSET(AC15,LCT,K14-1),OFFSET(AC15,LCT,J14-1)),IF(D14=E14,OFFSET(AC25,LCT,K14-1),OFFSET(AC25,LCT,J14-1)))","v":{"v":3.6,"d":"3.6000"}},{"$f":"IF(D8=1,OFFSET(AC15,LCT,K14-1),OFFSET(AC25,LCT,K14-1))","v":{"v":3.6,"d":"3.6000"}},{"$f":"IF(D8=2,ROUND(IF(D14=E14,OFFSET(AC25,LCT,K16-1),FORECAST(XDTT+TBTT,F14:G14,D14:E14)),3),ROUND(IF(D14=E14,OFFSET(AC15,LCT,K14-1),FORECAST(XDTT+TBTT,F14:G14,D14:E14)),3))","v":{"v":3.6,"d":"3.600"}},null,{"$f":"IF(XDTT+TBTT>AN15,K14,K14+1)","v":2},{"$f":"IF(D8=1,IF(XDTT+TBTT<=AC15,1,MATCH(XDTT+TBTT,AC15:AN15,1)),IF(XDTT+TBTT<=AC25,1,MATCH(XDTT+TBTT,AC25:AE25,1)))","v":1},{"$f":"IF(XDTT+TBTT>AE25,M14,M14+1)","v":2},{"$f":"IF(XDTT+TBTT<=AC25,1,MATCH(XDTT+TBTT,AC25:AN25,1))","v":1},{"$nulls":13},"TT","Loại công trình","Chi phí xây dựng và thiết bị (chưa có thuế GTGT) trong tổng mức đầu tư được duyệt (tỷ đồng)"]
[null,{"$f":"IF(C15<>\"\",COUNTA($C$14:C15)-COUNTIF($C$14:C15,\"\"),\"\")","v":""},{"$f":"IF(D8=1,\"Chi phí thẩm tra tính hiệu quả dự án đầu tư\",\"\")","v":""},{"$f":"IF(D8=1,IF(XDTT+TBTT<=AC140,AC140,OFFSET(AC140,0,J15-1)),0)","v":0},{"$f":"IF(D8=1,OFFSET(AC140,0,K15-1),0)","v":0},{"$f":"IF(D8=1,IF(D15=E15,OFFSET(AC140,LCT,K15-1),OFFSET(AC140,LCT,J15-1)),0)","v":{"v":0,"d":"0.0000"}},{"$f":"IF(D8=1,OFFSET(AC140,LCT,K15-1),0)","v":{"v":0,"d":"0.0000"}},{"$f":"IF(AND(D8=1,XDTT+TBTT>=15),ROUND(IF(D15=E15,OFFSET(AC140,LCT,K15-1),FORECAST(XDTT+TBTT,F15:G15,D15:E15)),3),0)","v":{"v":0,"d":"0.000"}},null,{"$f":"IF(XDTT+TBTT>AN140,K15,K15+1)","v":2},{"$f":"IF(XDTT+TBTT<=AC140,1,MATCH(XDTT+TBTT,AC140:AN140,1))","v":1},{"$nulls":17},{"v":15,"d":">=15"},20,50,100,200,500,{"v":1000,"d":"1,000"},{"v":2000,"d":"2,000"},{"v":5000,"d":"5,000"},{"v":10000,"d":"10,000"},{"v":20000,"d":"20,000"},{"v":30000,"d":"30,000"}]
[null,{"$f":"IF(C16<>\"\",COUNTA($C$14:C16)-COUNTIF($C$14:C16,\"\"),\"\")","v":""},{"$f":"IF(D6=3,\"Chi phí thiết kế kỹ thuật\",IF(D6=2,\"Chi phí thiết kế bản vẽ thi công\",\"\"))","v":""},{"$f":"IF(D8=1,IF(E16=8000,E16,IF(XDTT<=AC36,AC36,OFFSET(AC36,0,J16-1))),0)","v":0},{"$f":"IF(D8=1,OFFSET(AC36,0,K16-1),0)","v":0},{"$f":"IF(D8=1,IF(E16=8000,VLOOKUP(BTK,$M$19:$O$20,3,0),VLOOKUP(BTK,$M$19:$O$20,2,0)),0)","v":{"v":0,"d":"0.0000"}},{"$f":"IF(D8=1,VLOOKUP(BTK,$M$19:$O$20,3,0),0)","v":{"v":0,"d":"0.0000"}},{"$f":"IF(D8=1,ROUND(IF(D16=E16,G16,FORECAST(XDTT,F16:G16,D16:E16)),3),0)","v":{"v":0,"d":"0.000"}},null,{"$f":"IF(XDTT>AM36,K16,K16+1)","v":2},{"$f":"IF(XDTT<=AC36,1,MATCH(XDTT,AC36:AM36,1))","v":1},null,"Thiết kế kỹ thuật - 3 bước",{"$nulls":8},"Thiết kế BVTC - 2 bước",{"$nulls":4},1,"Công trình dân dụng",0.655,0.538,0.442,0.314,0.237,0.191,0.164,0.139,0.111,0.089,{"v":0.07,"d":"0.070"},0.057]
[null,{"$f":"IF(C17<>\"\",COUNTA($C$14:C17)-COUNTIF($C$14:C17,\"\"),\"\")","v":""},{"$f":"IF(D6=3,\"Chi phí thiết kế bản vẽ thi công\",\"\")","v":""},{"$nulls":4},{"$f":"IF(BTK=3,ROUND(IF(D5=2,H16*60%,H16*55%),3),0)","v":{"v":0,"d":"0.000"}},{"$nulls":7},"DD","CN","GT","TL","HT",null,"DD","CN","GT","TL","HT",2,"Công trình công nghiệp",0.934,0.794,{"v":0.63,"d":"0.630"},0.467,0.368,0.345,0.299,0.242,0.207,0.145,0.104,0.074]
[null,{"$f":"IF(C18<>\"\",COUNTA($C$14:C18)-COUNTIF($C$14:C18,\"\"),\"\")","v":2},"Chi phí thẩm tra thiết kế",{"$f":"IF(E18=8000,E18,IF(XDTT<=AC152,AC152,OFFSET(AC152,0,J18-1)))","v":10},{"$f":"OFFSET(AC152,0,K18-1)","v":10},{"$f":"IF(E18=8000,OFFSET(AC152,LCT,K18-1),IF(D18=E18,G18,OFFSET(AC152,LCT,J18-1)))","v":{"v":0.206,"d":"0.2060"}},{"$f":"OFFSET(AC152,LCT,K18-1)","v":{"v":0.206,"d":"0.2060"}},{"$f":"IF(D18=E18,G18,ROUND(FORECAST(XDTT,F18:G18,D18:E18),3))","v":0.206},null,{"$f":"IF(XDTT>AL152,K18,K18+1)","v":2},{"$f":"IF(XDTT<=AC152,1,MATCH(XDTT,AC152:AL152,1))","v":1},{"$nulls":4},1,2,3,4,5,null,1,2,3,4,5,3,"Công trình giao thông",0.492,0.449,0.358,0.281,0.194,{"v":0.15,"d":"0.150"},0.131,0.112,0.089,0.072,0.058,0.047]
[null,{"$f":"IF(C19<>\"\",COUNTA($C$14:C19)-COUNTIF($C$14:C19,\"\"),\"\")","v":3},"Chi phí thẩm tra dự toán",{"$f":"IF(E19=8000,E19,IF(XDTT<=AC163,AC163,OFFSET(AC163,0,J19-1)))","v":10},{"$f":"OFFSET(AC163,0,K19-1)","v":10},{"$f":"IF(E19=8000,OFFSET(AC163,LCT,K19-1),IF(D19=E19,G19,OFFSET(AC163,LCT,J19-1)))","v":{"v":0.2,"d":"0.2000"}},{"$f":"OFFSET(AC163,LCT,K19-1)","v":{"v":0.2,"d":"0.2000"}},{"$f":"IF(D19=E19,G19,ROUND(FORECAST(XDTT,F19:G19,D19:E19),3))","v":{"v":0.2,"d":"0.200"}},null,{"$f":"IF(XDTT>AL163,K19,K19+1)","v":2},{"$f":"IF(XDTT<=AC163,1,MATCH(XDTT,AC163:AL163,1))","v":1},null,3,{"$f":"HLOOKUP(LCT,$P$18:$T$20,2)","v":{"$error":"#N/A"}},{"$f":"HLOOKUP(LCT,$P$18:$T$20,3)","v":{"$error":"#N/A"}},{"$f":"HLOOKUP($D$16,$AC$36:$AM$41,CCT+1)","v":{"$error":"#N/A"}},{"$f":"HLOOKUP($D$16,$AC$57:$AM$62,CCT+1)","v":{"$error":"#N/A"}},{"$f":"HLOOKUP($D$16,$AC$78:$AM$83,CCT+1)","v":{"$error":"#N/A"}},{"$f":"HLOOKUP($D$16,$AC$99:$AM$104,CCT+1)","v":{"$error":"#N/A"}},{"$f":"HLOOKUP($D$16,$AC$120:$AM$125,CCT+1)","v":{"$error":"#N/A"}},null,{"$f":"HLOOKUP($D$16,$AC$46:$AM$51,CCT+1)","v":{"$error":"#N/A"}},{"$f":"HLOOKUP($D$16,$AC$67:$AM$72,CCT+1)","v":{"$error":"#N/A"}},{"$f":"HLOOKUP($D$16,$AC$88:$AM$93,CCT+1)","v":{"$error":"#N/A"}},{"$f":"HLOOKUP($D$16,$AC$109:$AM$114,CCT+1)","v":{"$error":"#N/A"}},{"$f":"HLOOKUP($D$16,$AC$130:$AM$135,CCT+1)","v":{"$error":"#N/A"}},4,"Công trình thủy lợi",0.589,0.536,0.428,{"v":0.3,"d":"0.300"},0.226,0.182,0.156,0.134,0.107,0.086,0.069,0.056]
[null,{"$f":"IF(C20<>\"\",COUNTA($C$14:C20)-COUNTIF($C$14:C20,\"\"),\"\")","v":4},"Chi phí lập HSMT, đánh giá HSDT thi công xây dựng",{"$f":"IF(E20=8000,E20,IF(XDTT<=AC173,AC173,OFFSET(AC173,0,J20-1)))","v":10},{"$f":"OFFSET(AC173,0,K20-1)","v":10},{"$f":"IF(E20=8000,OFFSET(AC173,LCT,K20-1),IF(D20=E20,G20,OFFSET(AC173,LCT,J20-1)))","v":{"v":0.337,"d":"0.3370"}},{"$f":"OFFSET(AC173,LCT,K20-1)","v":{"v":0.337,"d":"0.3370"}},{"$f":"IF(D20=E20,G20,ROUND(FORECAST(XDTT,F20:G20,D20:E20),3))","v":0.337},null,{"$f":"IF(XDTT>AL173,K20,K20+1)","v":2},{"$f":"IF(XDTT<=AC173,1,MATCH(XDTT,AC173:AL173,1))","v":1},null,2,{"$f":"HLOOKUP(LCT,$V$18:$Z$20,2)","v":{"$error":"#N/A"}},{"$f":"HLOOKUP(LCT,$V$18:$Z$20,3)","v":{"$error":"#N/A"}},{"$f":"HLOOKUP($E$16,$AC$36:$AM$41,CCT+1)","v":{"$error":"#N/A"}},{"$f":"HLOOKUP($E$16,$AC$57:$AM$62,CCT+1)","v":{"$error":"#N/A"}},{"$f":"HLOOKUP($E$16,$AC$78:$AM$83,CCT+1)","v":{"$error":"#N/A"}},{"$f":"HLOOKUP($E$16,$AC$99:$AM$104,CCT+1)","v":{"$error":"#N/A"}},{"$f":"HLOOKUP($E$16,$AC$120:$AM$125,CCT+1)","v":{"$error":"#N/A"}},null,{"$f":"HLOOKUP($E$16,$AC$46:$AM$51,CCT+1)","v":{"$error":"#N/A"}},{"$f":"HLOOKUP($E$16,$AC$67:$AM$72,CCT+1)","v":{"$error":"#N/A"}},{"$f":"HLOOKUP($E$16,$AC$88:$AM$93,CCT+1)","v":{"$error":"#N/A"}},{"$f":"HLOOKUP($E$16,$AC$109:$AM$114,CCT+1)","v":{"$error":"#N/A"}},{"$f":"HLOOKUP($E$16,$AC$130:$AM$135,CCT+1)","v":{"$error":"#N/A"}},5,"Công trình hạ tầng kỹ thuật",0.514,0.467,0.374,0.291,{"v":0.2,"d":"0.200"},0.156,0.137,0.117,0.094,0.075,{"v":0.06,"d":"0.060"},0.048]
[null,{"$f":"IF(C21<>\"\",COUNTA($C$14:C21)-COUNTIF($C$14:C21,\"\"),\"\")","v":5},"Chi phí lập HSMT, đánh giá HSDT mua sắm thiết bị",{"$f":"IF(E21=8000,E21,IF(TBTT<=AC183,AC183,OFFSET(AC183,0,J21-1)))","v":10},{"$f":"OFFSET(AC183,0,K21-1)","v":10},{"$f":"IF(E21=8000,OFFSET(AC183,LCT,K21-1),IF(D21=E21,G21,OFFSET(AC183,LCT,J21-1)))","v":{"v":0.287,"d":"0.2870"}},{"$f":"OFFSET(AC183,LCT,K21-1)","v":{"v":0.287,"d":"0.2870"}},{"$f":"IF(D3=0,0,ROUND(IF(D21=E21,G21,FORECAST(TBTT,F21:G21,D21:E21)),3))","v":{"v":0,"d":"0.000"}},null,{"$f":"IF(TBTT>AL183,K21,K21+1)","v":2},{"$f":"IF(TBTT<=AC183,1,MATCH(TBTT,AC183:AL183,1))","v":1}]
[null,{"$f":"IF(C22<>\"\",COUNTA($C$14:C22)-COUNTIF($C$14:C22,\"\"),\"\")","v":6},"Chi phí giám sát thi công xây dựng",{"$f":"IF(E22=8000,E22,IF(XDTT<=AC193,AC193,OFFSET(AC193,0,J22-1)))","v":10},{"$f":"OFFSET(AC193,0,K22-1)","v":10},{"$f":"IF(E22=8000,OFFSET(AC193,LCT,K22-1),IF(D22=E22,G22,OFFSET(AC193,LCT,J22-1)))","v":{"v":2.628,"d":"2.6280"}},{"$f":"OFFSET(AC193,LCT,K22-1)","v":{"v":2.628,"d":"2.6280"}},{"$f":"IF(D22=E22,G22,ROUND(FORECAST(XDTT,F22:G22,D22:E22),3))","v":2.628},null,{"$f":"IF(XDTT>AL193,K22,K22+1)","v":2},{"$f":"IF(XDTT<=AC193,1,MATCH(XDTT,AC193:AL193,1))","v":1},{"$nulls":15},"Bảng số 3: Định mức chi phí lập báo cáo kinh tế - kỹ thuật"]
[null,{"$f":"IF(C23<>\"\",COUNTA($C$14:C23)-COUNTIF($C$14:C23,\"\"),\"\")","v":7},"Chi phí giám sát lắp đặt thiết bị",{"$f":"IF(E23=8000,E23,IF(TBTT<=AC203,AC203,OFFSET(AC203,0,J23-1)))","v":10},{"$f":"OFFSET(AC203,0,K23-1)","v":10},{"$f":"IF(E23=8000,OFFSET(AC203,LCT,K23-1),IF(D23=E23,G23,OFFSET(AC203,LCT,J23-1)))","v":{"v":0.675,"d":"0.6750"}},{"$f":"OFFSET(AC203,LCT,K23-1)","v":{"v":0.675,"d":"0.6750"}},{"$f":"IF(D3=0,0,IF(D23=E23,G23,ROUND(FORECAST(TBTT,F23:G23,D23:E23),3)))","v":{"v":0,"d":"0.000"}},null,{"$f":"IF(TBTT>AL203,K23,K23+1)","v":2},{"$f":"IF(TBTT<=AC203,1,MATCH(TBTT,AC203:AL203,1))","v":1},{"$nulls":19},"Đơn vị tính: Tỷ lệ %"]
[null,"III","CHI PHÍ KHÁC (176/BTC và Thông tư 19/2011/TT-BTC)",{"$nulls":6},{"$f":"IF(LCT=1,\"V\",IF(LCT=2,\"I\",IF(LCT=3,\"IV\",IF(LCT=4,\"III\",\"II\"))))","v":"V"},{"$f":"IF(LCT=1,5,IF(LCT=2,1,IF(LCT=3,4,IF(LCT=4,3,2))))","v":5},{"$nulls":15},"TT","Loại công trình","Chi phí xây dựng và thiết bị (chưa có thuế GTGT) trong dự toán của Báo cáo kinh tế - kỹ thuật được duyệt (tỷ đồng)"]
[null,1,"Lệ phí thẩm định thiết kế",{"$f":"IF(XDTT<=AC226,AC226,OFFSET(AC226,0,J25-1))","v":0.5},{"$f":"OFFSET(AC226,0,K25-1)","v":0.5},{"$f":"IF(D25=E25,OFFSET(AC226,$K$24,K25-1),OFFSET(AC226,$K$24,J25-1))","v":{"v":0.096,"d":"0.0960"}},{"$f":"OFFSET(AC226,$K$24,K25-1)","v":{"v":0.096,"d":"0.0960"}},{"$f":"IF(D25=E25,G25,ROUND(FORECAST(XDTT,F25:G25,D25:E25),3))","v":0.096},null,{"$f":"IF(XDTT>AM226,K25,K25+1)","v":2},{"$f":"IF(XDTT<=AC226,1,MATCH(XDTT,AC226:AM226,1))","v":1},{"$nulls":17},3,7,15]
[null,2,"Lệ phí thẩm định dự toán",{"$f":"IF(XDTT<=AC232,AC232,OFFSET(AC232,0,J26-1))","v":0.5},{"$f":"OFFSET(AC232,0,K26-1)","v":0.5},{"$f":"IF(D26=E26,OFFSET(AC232,$K$24,K26-1),OFFSET(AC232,$K$24,J26-1))","v":{"v":0.072,"d":"0.0720"}},{"$f":"OFFSET(AC232,$K$24,K26-1)","v":{"v":0.072,"d":"0.0720"}},{"$f":"IF(D26=E26,G26,ROUND(FORECAST(XDTT,F26:G26,D26:E26),3))","v":0.072},null,{"$f":"IF(XDTT>AM232,K26,K26+1)","v":2},{"$f":"IF(XDTT<=AC232,1,MATCH(XDTT,AC232:AM232,1))","v":1},{"$nulls":15},1,"Công trình dân dụng",3.6,3.2,2.8]
[null,3,"Phí thẩm định dự án",{"$f":"IF(TMDT<=AC247,AC247,OFFSET(AC247,0,J27-1))","v":15},{"$f":"OFFSET(AC247,0,K27-1)","v":15},{"$f":"IF(D27=E27,OFFSET(AC247,1,K27-1),OFFSET(AC247,1,J27-1))","v":{"v":0.019,"d":"0.0190"}},{"$f":"OFFSET(AC247,1,K27-1)","v":{"v":0.019,"d":"0.0190"}},{"$f":"IF(D27=E27,G27,ROUND(FORECAST(TMDT,F27:G27,D27:E27),4))","v":0.019},null,{"$f":"IF(TMDT>AL247,K27,K27+1)","v":2},{"$f":"IF(TMDT<=AC247,1,MATCH(TMDT,AC247:AL247,1))","v":1},{"$nulls":15},2,"Công trình công nghiệp",3.7,3.3,2.9]
[null,4,"Chi phí kiểm toán",{"$f":"IF(TMDT<=AC212,AC212,OFFSET(AC212,0,J28-1))","v":5},{"$f":"OFFSET(AC212,0,K28-1)","v":5},{"$f":"IF(D28=E28,OFFSET(AC212,2,K28-1),OFFSET(AC212,2,J28-1))","v":{"v":0.64,"d":"0.6400"}},{"$f":"OFFSET(AC212,2,K28-1)","v":{"v":0.64,"d":"0.6400"}},{"$f":"IF(D28=E28,G28,ROUND(FORECAST(TMDT,F28:G28,D28:E28),3))","v":{"v":0.64,"d":"0.640"}},null,{"$f":"IF(TMDT>AJ212,K28,K28+1)","v":2},{"$f":"IF(TMDT<=AC212,1,MATCH(TMDT,AC212:AJ212,1))","v":1},{"$nulls":15},3,"Công trình giao thông",2.8,2.1,1.9]
[null,5,"Chi phí thẩm tra phê duyệt, quyết toán vốn",{"$f":"IF(TMDT<=AC212,AC212,OFFSET(AC212,0,J29-1))","v":5},{"$f":"OFFSET(AC212,0,K29-1)","v":5},{"$f":"IF(D29=E29,OFFSET(AC212,1,K29-1),OFFSET(AC212,1,J29-1))","v":{"v":0.38,"d":"0.3800"}},{"$f":"OFFSET(AC212,1,K29-1)","v":{"v":0.38,"d":"0.3800"}},{"$f":"IF(D29=E29,G29,ROUND(FORECAST(TMDT,F29:G29,D29:E29),3))","v":{"v":0.38,"d":"0.380"}},null,{"$f":"IF(TMDT>AJ212,K29,K29+1)","v":2},{"$f":"IF(TMDT<=AC212,1,MATCH(TMDT,AC212:AJ212,1))","v":1},{"$nulls":15},4,"Công trình thuỷ lợi",3.4,3,2.8]
[{"$nulls":26},5,"Công trình hạ tầng kỹ thuật",3.2,2.6,2.3]
[]
[{"$nulls":26},"3.3.10. Định mức chi phí thiết kế công trình dân dụng"]
[{"$nulls":26},"Bảng số 4: Định mức chi phí thiết kế kỹ thuật của công trình dân dụng có yêu cầu thiết kế 3 bước"]
[{"$nulls":12},"TMDT",{"$f":"D4/10^9","v":0},{"$nulls":24},"Đơn vị tính: Tỷ lệ %"]
[{"$nulls":12},"XDTT",{"$f":"D2/10^9","v":0.09964188100235769},{"$nulls":12},"TT","Cấp công trình","Chi phí xây dựng (chưa có thuế GTGT) trong dự toán công trình được duyệt (tỷ đồng)"]
[{"$nulls":12},"TBTT",{"$f":"D3/10^9","v":0},{"$nulls":14},{"v":7,"d":"<=7"},10,20,50,100,200,500,{"v":1000,"d":"1,000"},{"v":2000,"d":"2,000"},{"v":5000,"d":"5,000"},{"v":8000,"d":"8,000"}]
[{"$nulls":12},"Thiết kế 1 bước",{"$nulls":13},1,"Cấp đặc biệt",2.74,2.74,2.38,{"v":2,"d":"2.00"},1.82,1.66,{"v":1.4,"d":"1.40"},1.13,0.97,0.75,0.58]
[{"$nulls":12},"Thiết kế 2 bước",{"$nulls":13},2,"Cấp I",2.48,2.48,2.17,1.82,1.64,1.51,1.27,1.03,0.89,0.68,0.53]
[{"$nulls":12},"Thiết kế 3 bước",{"$nulls":13},3,"Cấp II",2.36,2.25,1.96,1.66,1.51,1.37,1.16,0.95,{"v":0.8,"d":"0.80"},0.62,0.47]
[{"$nulls":12},"Loại công trình",{"$nulls":13},4,"Cấp III",2.12,2.03,1.76,1.48,1.34,1.23,1.04,0.85,0.72,0.55,0.42]
[{"$nulls":12},"Bước thiết kế",{"$nulls":13},5,"Cấp IV",1.88,{"v":1.8,"d":"1.80"},1.57,1.23,1.04,0.88,0.75,0.61,0.61,0.61,0.61]
[{"$nulls":12},"Cấp công trình"]
[{"$nulls":12},"Lập dự án đầu tư",{"$nulls":13},"Bảng số 5: Định mức chi phí thiết kế bản vẽ thi công của công trình dân dụng có yêu cầu thiết kế 2 bước"]
[{"$nulls":12},"Báo cáo kinh tế kỹ thuật",{"$nulls":25},"Đơn vị tính: Tỷ lệ %"]
[{"$nulls":26},"TT","Cấp công trình","Chi phí xây dựng (chưa có thuế GTGT) trong dự toán công trình được duyệt (tỷ đồng)"]
[{"$nulls":28},{"v":7,"d":"<=7"},10,20,50,100,200,500,{"v":1000,"d":"1,000"},{"v":2000,"d":"2,000"},{"v":5000,"d":"5,000"},{"v":8000,"d":"8,000"}]
[{"$nulls":26},1,"Cấp đặc biệt",4.24,4.24,3.68,{"v":3.1,"d":"3.10"},2.82,2.57,2.17,1.75,{"v":1.5,"d":"1.50"},1.16,{"v":0.9,"d":"0.90"}]
[{"$nulls":26},2,"Cấp I",3.84,3.84,3.36,2.82,2.54,2.34,1.96,1.59,1.38,1.05,0.82]
[{"$nulls":26},3,"Cấp II",3.63,3.48,3.01,2.54,2.29,{"v":2.1,"d":"2.10"},1.79,1.45,1.24,0.96,0.73]
[{"$nulls":26},4,"Cấp III",3.27,3.15,2.73,2.29,2.08,{"v":1.9,"d":"1.90"},1.62,1.31,1.11,0.86,0.65]
[{"$nulls":26},5,"Cấp IV",{"v":2.9,"d":"2.90"},2.78,2.43,1.91,1.62,1.37,1.16,0.95,0.95,0.95,0.95]
[]
[{"$nulls":26},"3.3.11. Định mức chi phí thiết kế công trình công nghiệp"]
[{"$nulls":26},"Bảng số 6: Định mức chi phí thiết kế kỹ thuật của công trình công nghiệp có yêu cầu thiết kế 3 bước"]
[{"$nulls":38},"Đơn vị tính: Tỷ lệ %"]
[{"$nulls":26},"TT","Cấp công trình","Chi phí xây dựng (chưa có thuế GTGT) trong dự toán công trình được duyệt (tỷ đồng)"]
[{"$nulls":28},{"v":7,"d":"<=7"},10,20,50,100,200,500,{"v":1000,"d":"1,000"},{"v":2000,"d":"2,000"},{"v":5000,"d":"5,000"},{"v":8000,"d":"8,000"}]
[{"$nulls":26},1,"Cấp đặc biệt",2.79,2.79,2.58,2.21,2.01,1.82,1.66,1.45,1.23,0.95,0.73]
[{"$nulls":26},2,"Cấp I",2.33,2.33,2.15,1.83,1.67,1.51,1.38,1.21,1.03,0.79,0.61]
[{"$nulls":26},3,"Cấp II",1.99,1.94,1.79,1.53,1.39,1.26,1.15,1.01,0.86,0.66,0.51]
[{"$nulls":26},4,"Cấp III",1.73,1.69,1.56,1.32,1.2,1.1,1.01,0.9,0.77,0.59,0.46]
[{"$nulls":26},5,"Cấp IV",1.54,1.5,1.39,1.17,1.08,0.92,0.78,0.67,0.67,0.67,0.67]
[]
[{"$nulls":26},"Bảng số 7: Định mức chi phí thiết kế bản vẽ thi công của công trình công nghiệp có yêu cầu thiết kế 2 bước"]
[{"$nulls":38},"Đơn vị tính: Tỷ lệ %"]
[{"$nulls":26},"TT","Cấp công trình","Chi phí xây dựng (chưa có thuế GTGT) trong dự toán công trình được duyệt (tỷ đồng)"]
[{"$nulls":28},{"v":7,"d":"<=7"},10,20,50,100,200,500,{"v":1000,"d":"1,000"},{"v":2000,"d":"2,000"},{"v":5000,"d":"5,000"},{"v":8000,"d":"8,000"}]
[{"$nulls":26},1,"Cấp đặc biệt",4.67,4.67,4.12,3.53,3.21,2.91,2.65,2.32,1.96,1.52,1.16]
[{"$nulls":26},2,"Cấp I",3.73,3.73,3.44,2.92,2.67,2.41,2.2,1.93,1.64,1.26,0.97]
[{"$nulls":26},3,"Cấp II",3.07,2.99,2.76,2.35,2.15,1.94,1.77,1.55,1.32,1.02,0.78]
[{"$nulls":26},4,"Cấp III",2.76,2.69,2.49,2.11,1.92,1.75,1.61,1.44,1.22,0.94,0.72]
[{"$nulls":26},5,"Cấp IV",2.45,2.39,2.21,1.87,1.72,1.46,1.24,1.06,1.06,1.06,1.06]
[]
[{"$nulls":26},"3.3.12. Định mức chi phí thiết kế công trình giao thông"]
[{"$nulls":26},"Bảng số 8: Định mức chi phí thiết kế kỹ thuật của công trình giao thông có yêu cầu thiết kế 3 bước"]
[{"$nulls":38},"Đơn vị tính: Tỷ lệ %"]
[{"$nulls":26},"TT","Cấp công trình","Chi phí xây dựng (chưa có thuế GTGT) trong dự toán công trình được duyệt (tỷ đồng)"]
[{"$nulls":28},{"v":7,"d":"<=7"},10,20,50,100,200,500,{"v":1000,"d":"1,000"},{"v":2000,"d":"2,000"},{"v":5000,"d":"5,000"},{"v":8000,"d":"8,000"}]
[{"$nulls":26},1,"Cấp đặc biệt",1.81,1.81,1.67,1.46,1.26,{"v":1145,"d":"1145.000"},1.06,0.91,0.76,0.58,0.44]
[{"$nulls":26},2,"Cấp I",1.11,1.11,1.05,0.87,0.81,0.73,0.67,0.57,0.48,0.37,0.28]
[{"$nulls":26},3,"Cấp II",1.04,1.01,0.94,0.8,0.73,0.67,0.61,0.52,0.44,0.34,0.26]
[{"$nulls":26},4,"Cấp III",0.95,0.92,0.85,0.73,0.67,0.61,0.5,0.42,0.24,0.28,0.21]
[{"$nulls":26},5,"Cấp IV",0.85,0.83,0.76,0.66,0.6,0.51,0.43,0.37,0.31,0.24,0.24]
[]
[{"$nulls":26},"Bảng số 9: Định mức chi phí thiết kế bản vẽ thi công của công trình giao thông có yêu cầu thiết kế 2 bước"]
[{"$nulls":38},"Đơn vị tính: Tỷ lệ %"]
[{"$nulls":26},"TT","Cấp công trình","Chi phí xây dựng (chưa có thuế GTGT) trong dự toán công trình được duyệt (tỷ đồng)"]
[{"$nulls":28},{"v":7,"d":"<=7"},10,20,50,100,200,500,{"v":1000,"d":"1,000"},{"v":2000,"d":"2,000"},{"v":5000,"d":"5,000"},{"v":8000,"d":"8,000"}]
[{"$nulls":26},1,"Cấp đặc biệt",{"v":2.8,"d":"2.80"},{"v":2.8,"d":"2.80"},2.58,2.21,2.01,1.82,1.66,1.45,1.23,0.95,0.73]
[{"$nulls":26},2,"Cấp I",2.72,2.72,2.15,1.83,1.67,1.51,1.38,1.21,1.03,0.79,0.61]
[{"$nulls":26},3,"Cấp II",1.61,1.56,1.45,1.23,1.12,1.03,0.93,0.79,0.67,0.52,{"v":0.4,"d":"0.40"}]
[{"$nulls":26},4,"Cấp III",1.46,1.42,1.31,1.13,1.03,0.92,0.77,0.65,0.55,0.42,0.32]
[{"$nulls":26},5,"Cấp IV",1.31,1.28,1.18,1.01,0.92,0.78,0.66,0.57,0.48,0.37,0.37]
[]
[{"$nulls":26},"3.3.13. Định mức chi phí thiết kế công trình thủy lợi"]
[{"$nulls":26},"Bảng số 10: Định mức chi phí thiết kế kỹ thuật của công trình thuỷ lợi có yêu cầu thiết kế 3 bước"]
[{"$nulls":38},"Đơn vị tính: Tỷ lệ %"]
[{"$nulls":26},"TT","Cấp công trình","Chi phí xây dựng (chưa có thuế GTGT) trong dự toán công trình được duyệt (tỷ đồng)"]
[{"$nulls":28},{"v":7,"d":"<=7"},10,20,50,100,200,500,{"v":1000,"d":"1,000"},{"v":2000,"d":"2,000"},{"v":5000,"d":"5,000"},{"v":8000,"d":"8,000"}]
[{"$nulls":26},1,"Cấp đặc biệt",2.59,2.59,2.25,1.91,1.72,1.57,1.34,1.13,0.96,0.74,0.57]
[{"$nulls":26},2,"Cấp I",2.35,2.35,2.05,1.73,1.55,1.43,1.21,1.02,0.87,0.67,0.51]
[{"$nulls":26},3,"Cấp II",2.22,2.13,1.86,1.57,1.42,1.31,1.06,0.91,0.76,0.58,0.45]
[{"$nulls":26},4,"Cấp III",2.01,1.93,1.67,{"v":1.4,"d":"1.40"},1.27,1.08,0.92,0.78,0.67,0.51,{"v":0.4,"d":"0.40"}]
[{"$nulls":26},5,"Cấp IV",1.77,{"v":1.7,"d":"1.70"},1.49,{"v":1.1,"d":"1.10"},0.93,{"v":0.8,"d":"0.80"},0.67,0.58,0.49,0.38,0.38]
[]
[{"$nulls":26},"Bảng số 11: Định mức chi phí thiết kế bản vẽ thi công của công trình thuỷ lợi có yêu cầu thiết kế 2 bước"]
[{"$nulls":38},"Đơn vị tính: Tỷ lệ %"]
[{"$nulls":26},"TT","Cấp công trình","Chi phí xây dựng (chưa có thuế GTGT) trong dự toán công trình được duyệt (tỷ đồng)"]
[{"$nulls":28},{"v":7,"d":"<=7"},10,20,50,100,200,500,1000,2000,5000,8000]
[{"$nulls":26},1,"Cấp đặc biệt",4.01,4.01,3.48,2.96,2.66,2.43,2.07,1.75,1.48,1.14,0.88]
[{"$nulls":26},2,"Cấp I",3.64,3.64,3.17,2.68,{"v":2.4,"d":"2.40"},2.21,1.87,1.58,1.34,1.03,0.79]
[{"$nulls":26},3,"Cấp II",3.42,3.29,2.87,2.41,2.19,2.01,1.62,1.38,1.17,{"v":0.9,"d":"0.90"},0.51]
[{"$nulls":26},4,"Cấp III",3.11,2.98,2.58,2.16,1.96,1.67,1.42,1.21,1.03,0.79,0.46]
[{"$nulls":26},5,"Cấp IV",2.74,2.63,2.31,{"v":1.7,"d":"1.70"},1.44,1.23,1.04,0.89,0.75,0.58,0.58]
[]
[{"$nulls":26},"3.3.14. Định mức chi phí thiết kế công trình hạ tầng kỹ thuật"]
[{"$nulls":26},"Bảng số 12: Định mức chi phí thiết kế kỹ thuật của công trình hạ tầng kỹ thuật có yêu cầu thiết kế 3 bước"]
[{"$nulls":38},"Đơn vị tính: Tỷ lệ %"]
[{"$nulls":26},"TT","Cấp công trình","Chi phí xây dựng (chưa có thuế GTGT) trong dự toán công trình được duyệt (tỷ đồng)"]
[{"$nulls":28},{"v":7,"d":"<=7"},10,20,50,100,200,500,{"v":1000,"d":"1,000"},{"v":2000,"d":"2,000"},{"v":5000,"d":"5,000"},{"v":8000,"d":"8,000"}]
[{"$nulls":26},1,"Cấp đặc biệt",1.95,1.95,1.69,1.42,1.29,1.18,0.99,0.84,0.72,0.55,0.42]
[{"$nulls":26},2,"Cấp I",1.77,1.77,1.54,1.31,1.17,1.07,0.85,0.72,0.61,0.47,0.31]
[{"$nulls":26},3,"Cấp II",1.68,1.61,1.41,1.18,1.06,0.98,0.78,0.67,0.57,0.44,0.29]
[{"$nulls":26},4,"Cấp III",{"v":1.5,"d":"1.50"},1.44,1.26,1.05,0.96,0.84,0.76,0.64,0.55,0.42,0.27]
[{"$nulls":26},5,"Cấp IV",1.34,1.28,1.11,0.88,0.8,0.6,0.58,0.5,0.42,0.32,0.32]
[]
[{"$nulls":26},"Bảng số 13: Định mức chi phí thiết kế bản vẽ thi công của công trình hạ tầng kỹ thuật có yêu cầu thiết kế 2 bước"]
[{"$nulls":38},"Đơn vị tính: Tỷ lệ %"]
[{"$nulls":26},"TT","Cấp công trình","Chi phí xây dựng (chưa có thuế GTGT) trong dự toán công trình được duyệt (tỷ đồng)"]
[{"$nulls":28},{"v":7,"d":"<=7"},10,20,50,100,200,500,{"v":1000,"d":"1,000"},{"v":2000,"d":"2,000"},{"v":5000,"d":"5,000"},{"v":8000,"d":"8,000"}]
[{"$nulls":26},1,"Cấp đặc biệt",3.02,3.02,2.61,2.2,1.99,1.82,1.53,1.3,1.11,0.85,0.65]
[{"$nulls":26},2,"Cấp I",2.74,2.74,2.38,2.03,1.81,1.65,1.31,1.11,0.94,0.72,0.56]
[{"$nulls":26},3,"Cấp II",2.58,2.48,2.15,1.81,1.64,1.51,1.21,1.02,0.87,0.67,0.51]
[{"$nulls":26},4,"Cấp III",2.32,2.23,1.94,1.62,1.48,1.29,1.17,0.99,0.84,0.64,0.41]
[{"$nulls":26},5,"Cấp IV",2.07,1.98,1.72,1.35,1.23,0.92,0.89,0.76,0.64,0.49,0.49]
[]
[{"$nulls":26},"Bảng số 14: Định mức chi phí thẩm tra tính hiệu quả và tính khả thi của dự án đầu tư"]
[{"$nulls":39},"Đơn vị tính: Tỷ lệ %"]
[{"$nulls":26},"TT","Loại công trình","Chi phí xây dựng và thiết bị (chưa có thuế GTGT) trong tổng mức đầu tư được duyệt (tỷ đồng)"]
[{"$nulls":28},{"v":15,"d":">=15"},20,50,100,200,500,{"v":1000,"d":"1,000"},{"v":2000,"d":"2,000"},{"v":5000,"d":"5,000"},{"v":10000,"d":"10,000"},{"v":20000,"d":"20,000"},{"v":30000,"d":"30,000"}]
[{"$nulls":26},1,"Công trình dân dụng",0.098,0.081,0.066,0.047,0.035,0.023,{"v":0.02,"d":"0.020"},0.017,0.014,{"v":0.01,"d":"0.010"},0.008,0.006]
[{"$nulls":26},2,"Công trình công nghiệp",{"v":0.14,"d":"0.140"},0.119,0.095,{"v":0.07,"d":"0.070"},0.055,0.041,0.036,0.029,0.025,0.015,{"v":0.01,"d":"0.010"},0.007]
[{"$nulls":26},3,"Công trình giao thông",0.074,0.067,0.054,0.042,0.029,0.018,0.016,0.013,0.011,0.007,0.005,0.004]
[{"$nulls":26},4,"Công trình thuỷ lợi",0.088,{"v":0.08,"d":"0.080"},0.064,0.045,0.034,0.022,0.019,0.016,0.013,0.009,0.007,0.005]
[{"$nulls":26},5,"Công trình hạ tầng",0.077,{"v":0.07,"d":"0.070"},0.056,0.044,{"v":0.03,"d":"0.030"},0.019,0.017,0.014,0.012,0.008,0.006,0.004]
[]
[{"$nulls":26},"Bảng số 15: Định mức chi phí thẩm tra thiết kế kỹ thuật đối với công trình có yêu cầu thiết kế 3 bước; thẩm tra thiết kế bản vẽ thi công"]
[{"$nulls":26},"đối với công trình có yêu cầu thiết kế 1 bước và 2 bước"]
[{"$nulls":37},"Đơn vị tính: Tỷ lệ %"]
[{"$nulls":26},"TT","Loại công trình","Chi phí xây dựng (chưa có thuế GTGT) trong dự toán công trình hoặc"]
[{"$nulls":28},"dự toán gói thầu được duyệt (tỷ đồng)"]
[{"$nulls":28},{"v":10,"d":"<=10"},20,50,100,200,500,{"v":1000,"d":"1,000"},{"v":2000,"d":"2,000"},{"v":5000,"d":"5,000"},{"v":8000,"d":"8,000"}]
[{"$nulls":26},1,"Công trình dân dụng",0.206,0.179,0.138,0.106,0.081,0.063,0.051,0.036,0.028,0.024]
[{"$nulls":26},2,"Công trình công nghiệp",0.238,0.206,0.158,0.121,0.094,0.073,0.055,0.044,0.033,0.028]
[{"$nulls":26},3,"Công trình giao thông",0.136,0.118,0.09,0.069,0.054,0.041,0.031,0.026,0.02,0.017]
[{"$nulls":26},4,"Công trình thuỷ lợi",0.151,0.13,0.1,0.076,0.06,0.046,0.035,0.029,0.021,0.018]
[{"$nulls":26},5,"Công trình hạ tầng kỹ",0.158,0.138,0.106,0.081,0.063,0.049,0.038,0.033,0.024,0.021]
[]
[{"$nulls":26},"Bảng số 16: Định mức chi phí thẩm tra dự toán công trình"]
[{"$nulls":37},"Đơn vị tính: Tỷ lệ %"]
[{"$nulls":26},"TT","Loại công trình","Chi phí xây dựng (chưa có thuế GTGT) trong dự toán công trình hoặc"]
[{"$nulls":28},"dự toán gói thầu được duyệt (tỷ đồng)"]
[{"$nulls":28},{"v":10,"d":"<=10"},20,50,100,200,500,{"v":1000,"d":"1,000"},{"v":2000,"d":"2,000"},{"v":5000,"d":"5,000"},{"v":8000,"d":"8,000"}]
[{"$nulls":26},1,"Công trình dân dụng",{"v":0.2,"d":"0.200"},0.175,0.133,0.104,0.078,0.058,0.048,0.035,0.026,0.023]
[{"$nulls":26},2,"Công trình công nghiệp",0.231,{"v":0.2,"d":"0.200"},0.151,0.118,{"v":0.09,"d":"0.090"},0.069,0.051,0.041,0.029,0.025]
[{"$nulls":26},3,"Công trình giao thông",0.133,0.114,0.085,0.068,0.051,0.039,{"v":0.03,"d":"0.030"},0.025,0.018,0.015]
[{"$nulls":26},4,"Công trình thuỷ lợi",0.146,0.126,0.095,0.075,0.058,0.044,0.033,0.028,{"v":0.02,"d":"0.020"},0.017]
[{"$nulls":26},5,"Công trình hạ tầng kỹ thuật",0.153,0.133,0.103,0.078,0.059,0.046,0.036,{"v":0.03,"d":"0.030"},0.021,0.018]
[]
[{"$nulls":26},"Bảng số 17: Định mức chi phí lập hồ sơ mời thầu, đánh giá hồ sơ dự thầu thi công xây dựng"]
[{"$nulls":37},"Đơn vị tính: Tỷ lệ %"]
[{"$nulls":26},"TT","Loại công trình","Chi phí xây dựng (chưa có thuế GTGT) trong dự toán gói thầu được duyệt (tỷ đồng)"]
[{"$nulls":28},{"v":10,"d":"<=10"},20,50,100,200,500,{"v":1000,"d":"1,000"},{"v":2000,"d":"2,000"},{"v":5000,"d":"5,000"},{"v":8000,"d":"8,000"}]
[{"$nulls":26},1,"Công trình dân dụng",0.337,{"v":0.27,"d":"0.270"},0.152,0.099,0.059,0.043,{"v":0.03,"d":"0.030"},0.026,0.022,0.019]
[{"$nulls":26},2,"Công trình công nghiệp",0.439,0.303,0.169,0.115,0.074,0.053,{"v":0.04,"d":"0.040"},0.034,0.027,0.023]
[{"$nulls":26},3,"Công trình giao thông",{"v":0.27,"d":"0.270"},0.185,0.118,{"v":0.07,"d":"0.070"},0.045,0.035,0.022,0.019,0.016,0.014]
[{"$nulls":26},4,"Công trình thuỷ lợi",0.282,0.236,{"v":0.13,"d":"0.130"},0.074,0.047,0.037,0.024,0.021,0.018,0.016]
[{"$nulls":26},5,"Công trình hạ tầng kỹ thuật",0.303,0.254,0.135,0.083,0.049,{"v":0.04,"d":"0.040"},0.026,0.022,0.019,0.017]
[]
[{"$nulls":26},"Bảng số 18: Định mức chi phí lập hồ sơ mời thầu, đánh giá hồ sơ dự thầu mua sắm thiết bị"]
[{"$nulls":37},"Đơn vị tính: Tỷ lệ %"]
[{"$nulls":26},"TT","Loại công trình","Chi phí thiết bị (chưa có thuế GTGT) trong dự toán gói thầu được duyệt (tỷ đồng)"]
[{"$nulls":28},{"v":10,"d":"<=10"},20,50,100,200,500,{"v":1000,"d":"1,000"},{"v":2000,"d":"2,000"},{"v":5000,"d":"5,000"},{"v":8000,"d":"8,000"}]
[{"$nulls":26},1,"Công trình dân dụng",0.287,0.27,0.142,0.089,0.079,0.066,0.045,0.035,0.027,0.023]
[{"$nulls":26},2,"Công trình công nghiệp",0.439,0.395,0.224,0.141,0.122,0.1,0.068,0.054,0.041,0.036]
[{"$nulls":26},3,"Công trình giao thông",0.204,0.179,0.103,0.066,0.058,0.046,0.032,0.026,0.021,0.019]
[{"$nulls":26},4,"Công trình thuỷ lợi",0.219,0.191,0.11,0.07,0.061,0.049,0.04,0.03,0.024,0.02]
[{"$nulls":26},5,"Công trình hạ tầng kỹ thuật",0.236,0.203,0.122,0.079,0.068,0.056,0.044,0.034,0.026,0.022]
[]
[{"$nulls":26},"Bảng số 19: Định mức chi phí giám sát thi công xây dựng"]
[{"$nulls":37},"Đơn vị tính: Tỷ lệ %"]
[{"$nulls":26},"TT","Loại công trình","Chi phí xây dựng (chưa có thuế GTGT) trong dự toán gói thầu được duyệt (tỷ đồng)"]
[{"$nulls":28},{"v":10,"d":"<=10"},20,50,100,200,500,{"v":1000,"d":"1,000"},{"v":2000,"d":"2,000"},{"v":5000,"d":"5,000"},{"v":8000,"d":"8,000"}]
[{"$nulls":26},1,"Công trình dân dụng",2.628,2.282,1.948,1.512,1.267,0.974,0.653,0.589,0.529,0.46]
[{"$nulls":26},2,"Công trình công nghiệp",2.806,{"v":2.51,"d":"2.510"},2.047,{"v":1.7,"d":"1.700"},1.314,1.066,0.674,0.607,0.546,0.474]
[{"$nulls":26},3,"Công trình giao thông",2.562,{"v":2.16,"d":"2.160"},1.885,1.405,1.043,0.822,0.599,0.539,0.485,0.422]
[{"$nulls":26},4,"Công trình thuỷ lợi",2.079,1.834,{"v":1.66,"d":"1.660"},1.266,0.974,0.779,0.518,0.466,0.419,0.364]
[{"$nulls":26},5,"Công trình hạ tầng kỹ thuật",2.053,1.805,1.588,1.198,0.936,0.748,0.478,0.431,0.388,0.337]
[]
[{"$nulls":26},"Bảng số 20: Định mức chi phí giám sát lắp đặt thiết bị"]
[{"$nulls":37},"Đơn vị tính: Tỷ lệ %"]
[{"$nulls":26},"TT","Loại công trình","Chi phí thiết bị (chưa có thuế GTGT) trong dự toán gói thầu được duyệt (tỷ đồng)"]
[{"$nulls":28},{"v":10,"d":"<=10"},20,50,100,200,500,{"v":1000,"d":"1,000"},{"v":2000,"d":"2,000"},{"v":5000,"d":"5,000"},{"v":8000,"d":"8,000"}]
[{"$nulls":26},1,"Công trình dân dụng",0.675,0.572,0.477,0.315,0.25,0.214,0.144,0.13,0.117,0.102]
[{"$nulls":26},2,"Công trình công nghiệp",0.918,0.804,0.767,0.649,0.402,0.346,0.292,0.262,0.235,0.204]
[{"$nulls":26},3,"Công trình giao thông",0.542,0.464,0.389,0.256,0.214,0.178,0.12,0.108,0.097,0.084]
[{"$nulls":26},4,"Công trình thuỷ lợi",0.574,0.468,0.416,0.275,0.226,0.19,0.13,0.117,0.105,0.091]
[{"$nulls":26},5,"Công trình hạ tầng kỹ thuật",0.643,0.552,0.46,0.307,0.246,0.214,0.142,0.127,0.114,0.099]
[]
[{"$nulls":27},"Chi phí kiểm toán, thẩm tra phê duyệt quyết toán (Thông tư 19/2011/QĐ-BTC)"]
[{"$nulls":27},"Loại chi phí","Tổng mức đầu tư (tỷ đồng)"]
[{"$nulls":28},5,10,50,100,500,1000,10000,20000]
[{"$nulls":27},"Chi phí thẩm tra, phê duyệt quyết toán vốn",0.38,0.26,0.19,0.15,0.09,0.06,0.032,0]
[{"$nulls":27},"Chi phí kiểm toán",0.64,0.43,0.3,0.23,0.13,0.086,0.046,0]
[]
[{"$nulls":26},"Biểu mức thu lệ phí thẩm định đầu tư (109/2000/TT-BTC ngày 13/11/2000 của Bộ Tài Chính)"]
[{"$nulls":26},"Nhóm","Lệ phí thẩm định","Giá trị công trình (ĐV tỷ đồng và không bao gồm thuế GTGT)"]
[{"$nulls":26},"DA",null,"Tổng mức đầu tư phê duyệt"]
[{"$nulls":28},0.5,1,5,15,25,50,100,200,500,1000,2000]
[{"$nulls":26},"I","Dự án đầu tư nhóm I",null,0.025,0.023,0.019,0.017,0.015,0.0125,0.01,0.0075,0.0047,0.0025]
[{"$nulls":26},"II","Dự án đầu tư nhóm II",null,0.025,0.023,0.019,0.017,0.015,0.0125,0.01,0.0075,0.0047,0.0025]
[{"$nulls":26},"III","Dự án đầu tư nhóm III",null,0.025,0.023,0.019,0.017,0.015,0.0125,0.01,0.0075,0.0047,0.0025]
[{"$nulls":26},"IV","Dự án đầu tư nhóm IV",null,0.025,0.023,0.019,0.017,0.015,0.0125,0.01,0.0075,0.0047,0.0025]
[{"$nulls":26},"V","Dự án đầu tư nhóm V",null,0.025,0.023,0.019,0.017,0.015,0.0125,0.01,0.0075,0.0047,0.0025]
[{"$nulls":27},"","Dự toán giá trị xây lắp"]
[{"$nulls":27},"",0.5,1,5,15,25,50,100,200,500,1000,2000]
[{"$nulls":26},"I","Thiết kế kỹ thuật nhóm I",0.1026,0.0855,0.0765,0.0675,0.045,0.036,0.0315,0.0225,0.0157,0.0112,0.0056]
[{"$nulls":26},"II","Thiết kế kỹ thuật nhóm II",0.0702,0.0585,0.054,0.045,0.0315,0.0252,0.022,0.0157,0.0112,0.0081,0.0045]
[{"$nulls":26},"III","Thiết kế kỹ thuật nhóm III",0.0666,0.0558,0.0513,0.0427,0.0301,0.0238,0.0211,0.0148,0.0108,7.6E-3,0.004]
[{"$nulls":26},"IV","Thiết kế kỹ thuật nhóm IV",0.0666,0.0558,0.0513,0.0427,0.0301,0.0238,0.0211,0.0148,0.0108,7.6E-3,0.004]
[{"$nulls":26},"V","Thiết kế kỹ thuật nhóm V",0.096,0.072,0.0675,0.0585,0.0382,0.0306,0.027,0.0193,0.0112,0.0099,0.0055]
[{"$nulls":27},"",0.5,1,5,15,25,50,100,200,500,1000,2000]
[{"$nulls":26},"I","Tổng dự toán nhóm I",0.09,0.075,0.065,0.05,0.034,0.024,0.0225,0.018,0.0115,0.0095,0.005]
[{"$nulls":26},"II","Tổng dự toán nhóm II",0.108,0.09,0.08,0.06,0.04,0.034,0.0265,0.022,0.0165,0.0115,0.0057]
[{"$nulls":26},"III","Tổng dự toán nhóm III",0.0755,0.063,0.056,0.042,0.029,0.028,0.0185,0.015,0.0115,0.008,0.0045]
[{"$nulls":26},"IV","Tổng dự toán nhóm IV",0.0755,0.063,0.056,0.042,0.029,0.028,0.0185,0.015,0.0115,0.008,0.0045]
[{"$nulls":26},"V","Tổng dự toán nhóm V",0.072,0.06,0.053,0.04,0.0275,0.0265,0.0175,0.0145,0.011,0.0075,0.004]
[]
[{"$nulls":27},"Chi phí kiểm toán, thẩm tra phê duyệt quyết toán (Thông tư 33/2007 - Đính chính 2173/QĐ-BTC)"]
[{"$nulls":27},"Loại chi phí","Tổng mức đầu tư (tỷ đồng)"]
[{"$nulls":28},5,10,50,100,500,1000,10000,20000]
[{"$nulls":27},"Chi phí thẩm tra, phê duyệt quyết toán vốn",0.32,0.21,0.16,0.13,0.06,0.04,0.012,0.008]
[{"$nulls":27},"Chi phí kiểm toán",0.5,0.34,0.24,0.18,0.1,0.06,0.02,0.012]
[]
[{"$nulls":27},"BIỂU MỨC THU PHÍ THẨM ĐỊNH DỰ ÁN ĐẦU TƯ XÂY DỰNG"]
[{"$nulls":27},"(theo Thông tư số 176/2011/TT-BTC ngày 6/12/2011 của Bộ Tài chính)"]
[{"$nulls":27},"Tổng mức đầu tư DA (tỷ đ)",15,25,50,100,200,500,{"v":1000,"d":"1,000"},{"v":2000,"d":"2,000"},{"v":5000,"d":"5,000"},{"v":10000,"d":"10,000"}]
[{"$nulls":27},"Tỷ lệ %",0.019,0.017,0.015,0.0125,0.01,0.0075,0.0047,0.0025,2E-3,1E-3]

{"sheet":"Bia2","index":28,"n_rows":45,"n_cols":14,"rows_kept":45,"merged":[[15,4,15,7]]}
[]
["CÔNG TY CP GIÁ XÂY DỰNG",{"$nulls":4},"CỘNG HOÀ XÃ HỘI CHỦ NGHĨA VIỆT NAM"]
["WWW.GIAXAYDUNG.VN",{"$nulls":4},"Độc lập - Tự do - Hạnh phúc"]
[]
["          Số : ……./………."]
[]
[]
[]
["DỰ TOÁN LẮP ĐẶT THIẾT BỊ"]
[]
[{"$nulls":3},"DỰ ÁN:",{"$f":"'Bia1'!E11","v":0}]
[{"$nulls":3},"CÔNG TRÌNH:",{"$f":"Ts!B4","v":"NHÀ BIỆT THỰ GXD"}]
[{"$nulls":3},"ĐỊA ĐIỂM:",{"$f":"Ts!B10","v":"SỐ 2A, NGÕ 55, NGUYỄN NGỌC NẠI, THANH XUÂN, HÀ NỘI"}]
[{"$nulls":3},"CHỦ ĐẦU TƯ:",{"$f":"Ts!B8","v":"CÔNG TY GIÁ XÂY DỰNG"}]
[]
[{"$nulls":3},"Giá trị dự toán:",{"$f":"'TH CP thiet bi'!F13","v":0},{"$nulls":3},"đồng"]
[{"$nulls":3},{"$f":"\"(Bằng chữ: \"&vnd(E16)&\")\"","v":"(Bằng chữ:  đồng.)"}]
[]
[]
[{"$nulls":7},"Hà Nội, ","ngày",{"$f":"NOW()","v":"2013-12-24T23:43:21.750"},"tháng",{"$f":"NOW()","v":"2013-12-24T23:43:21.750"},"năm",{"$f":"NOW()","v":"2013-12-24T23:43:21.750"}]
[{"$nulls":8},"GIÁM ĐỐC"]
[]
[]
[]
[]
[]
[{"$nulls":8},"NGUYỄN THÀNH CÔNG"]
[]
[]
["CÔNG TY CP GIÁ XÂY DỰNG",{"$nulls":4},"CỘNG HOÀ XÃ HỘI CHỦ NGHĨA VIỆT NAM"]
["WWW.GIAXAYDUNG.VN",{"$nulls":4},"Độc lập - Tự do - Hạnh phúc"]
{"$rows_empty":7}
["DỰ TOÁN LẮP ĐẶT THIẾT BỊ"]
["Số : ……./……."]
[]
[{"$nulls":3},"CÔNG TRÌNH: ",{"$f":"IF(Ts!B4=\"\",\"\",Ts!B4)","v":"NHÀ BIỆT THỰ GXD"}]
[{"$nulls":3},"HẠNG MỤC: ",{"$f":"IF(Ts!B6=\"\",\"\",Ts!B6)","v":"ĐỔI BẢNG MÃ FONT RẤT ĐƠN GIẢN TRONG DỰ TOÁN GXD"}]
[{"$nulls":3},"ĐỊA ĐIỂM:",{"$f":"Ts!B10","v":"SỐ 2A, NGÕ 55, NGUYỄN NGỌC NẠI, THANH XUÂN, HÀ NỘI"}]
[{"$nulls":3},"CHỦ ĐẦU TƯ:",{"$f":"Ts!B8","v":"CÔNG TY GIÁ XÂY DỰNG"}]

{"sheet":"TH CP thiet bi","index":29,"n_rows":19,"n_cols":6,"rows_kept":19}
["BẢNG TỔNG HỢP DỰ TOÁN CHI PHÍ THIẾT BỊ"]
[{"$f":"'Bia1'!D42&'Bia1'!E42","v":"CÔNG TRÌNH: NHÀ BIỆT THỰ GXD"}]
[{"$f":"'Bia2'!D43&'Bia2'!E43","v":"HẠNG MỤC: ĐỔI BẢNG MÃ FONT RẤT ĐƠN GIẢN TRONG DỰ TOÁN GXD"}]
[{"$nulls":5},"ĐVT: đồng"]
["STT","TÊN THIẾT BỊ HAY NHÓM THIẾT BỊ","CÁCH TÍNH","CHI PHÍ TRƯỚC THUẾ","THUẾ GTGT","CHI PHÍ SAU THUẾ"]
[]
[1,"Chi phí mua sắm thiết bị (Gmstb)","bảng tính",{"$f":"'CP mua sam tbi'!F13","v":0},{"$f":"'CP mua sam tbi'!G13","v":0},{"$f":"'CP mua sam tbi'!H13","v":0}]
[2,"Chi phí đào tạo và chuyển giao công nghệ (Gdtcg)","bảng tính",{"$f":"'CP dao tao'!F22","v":0},{"$f":"'CP dao tao'!G22","v":0},{"$f":"'CP dao tao'!H22","v":0}]
[3,"Chi phí lắp đặt thiết bị và thí nghiệm, hiệu chỉnh (Gld)","(3.1)+(3.2)",{"$f":"D10+D11","v":0},{"$f":"E10+E11","v":0},{"$f":"F10+F11","v":0}]
["3.1","Chi phí lắp đặt thiết bị và thí nghiệm, hiệu chỉnh","bảng tính",{"$f":"'Hang muc TB'!C12","v":0},{"$f":"'Hang muc TB'!D12","v":0},{"$f":"'Lap dat'!D23","v":0}]
["3.2","Chi phí nhà tạm tại hiện trường để ở và điều hành thi công","bảng tính",{"$f":"F11/1.1","v":0},{"$f":"F11-D11","v":0},{"$f":"'Hang muc TB'!F12","v":0}]
[null,"Tổng cộng:","(1)+(2)+(3)",{"$f":"D7+D8+D9","v":0},{"$f":"E7+E8+E9","v":0},{"$f":"F7+F8+F9","v":0}]
[null,"LÀM TRÒN (GTB)",null,{"$f":"ROUND(D12,-3)","v":0},{"$f":"ROUND(E12,-3)","v":0},{"$f":"SUM(D13:E13)","v":0}]
[]
[null,"NGƯỜI LẬP","NGƯỜI CHỦ TRÌ"]
[]
[]
[]
[null,null,"Chứng chỉ KS định giá XD hạng …, số …"]

{"sheet":"CP mua sam tbi","index":30,"n_rows":19,"n_cols":10,"rows_kept":19}
["BẢNG DỰ TOÁN CHI PHÍ MUA SẮM THIẾT BỊ"]
[{"$f":"'Bia1'!D42&'Bia1'!E42","v":"CÔNG TRÌNH: NHÀ BIỆT THỰ GXD"}]
[{"$f":"'Bia2'!D43&'Bia2'!E43","v":"HẠNG MỤC: ĐỔI BẢNG MÃ FONT RẤT ĐƠN GIẢN TRONG DỰ TOÁN GXD"}]
[{"$nulls":7},"ĐVT: đồng"]
["STT","TÊN THIẾT BỊ HAY NHÓM THIẾT BỊ","ĐƠN VỊ TÍNH","KHỐI LƯỢNG","ĐƠN GIÁ\nTRƯỚC THUẾ","THÀNH TIỀN\nTRƯỚC THUẾ","THUẾ GTGT","THÀNH TIỀN\nSAU THUẾ","THUẾ SUẤT","GHI CHÚ NGUỒN MUA, BÁO GIÁ"]
[]
[1,"Thiết bị 1",{"$nulls":3},{"$f":"D7*E7","v":0},{"$f":"F7*I7","v":0},{"$f":"F7+G7","v":0},{"v":0.1,"d":"10%"}]
[2,"Thiết bị 2",{"$nulls":3},{"$f":"D8*E8","v":0},{"$f":"F8*I8","v":0},{"$f":"F8+G8","v":0},{"v":0.1,"d":"10%"}]
[3,"Thiết bị 3",{"$nulls":3},{"$f":"D9*E9","v":0},{"$f":"F9*I9","v":0},{"$f":"F9+G9","v":0},{"v":0.1,"d":"10%"}]
["…","…",{"$nulls":3},{"$f":"D10*E10","v":0},{"$f":"F10*I10","v":0},{"$f":"F10+G10","v":0},{"v":0.1,"d":"10%"}]
["n","Thiết bị n",{"$nulls":3},{"$f":"D11*E11","v":0},{"$f":"F11*I11","v":0},{"$f":"F11+G11","v":0},{"v":0.1,"d":"10%"}]
[null,"Cộng chi phí mua sắm thiết bị (Gmstb)",{"$nulls":3},{"$f":"SUM(F7:F11)","v":0},{"$f":"SUM(G7:G11)","v":0},{"$f":"SUM(H7:H11)","v":0}]
[null,"LÀM TRÒN (GTB)",{"$nulls":3},{"$f":"ROUND(F12,-3)","v":0},{"$f":"ROUND(G12,-3)","v":0},{"$f":"SUM(F13:G13)","v":0}]
[]
[null,"NGƯỜI LẬP",null,"NGƯỜI CHỦ TRÌ"]
[]
[]
[]
[{"$nulls":3},"Chứng chỉ KS định giá XD hạng …, số …"]

{"sheet":"CP dao tao","index":31,"n_rows":22,"n_cols":9,"rows_kept":22}
["BẢNG TỔNG HỢP CHI PHÍ ĐÀO TẠO CHUYỂN GIAO CÔNG NGHỆ"]
[{"$f":"'Bia1'!D42&'Bia1'!E42","v":"CÔNG TRÌNH: NHÀ BIỆT THỰ GXD"}]
[{"$f":"'Bia2'!D43&'Bia2'!E43","v":"HẠNG MỤC: ĐỔI BẢNG MÃ FONT RẤT ĐƠN GIẢN TRONG DỰ TOÁN GXD"}]
[{"$nulls":7},"ĐVT: đồng"]
["STT","NỘI DUNG CHI PHÍ","ĐVT","KHỐI LƯỢNG","ĐƠN GIÁ\nTRƯỚC THUẾ","CHI PHÍ TRƯỚC THUẾ","THUẾ GTGT","CHI PHÍ SAU THUẾ","THUẾ SUẤT"]
[]
["I","Chi phí trực tiếp",{"$nulls":3},{"$f":"SUM(F8,F12,F13:F16)","v":0},{"$f":"SUM(G8,G12,G13:G16)","v":0},{"$f":"SUM(H8,H12,H13:H16)","v":0}]
[1,"Chi phí đi lại",{"$nulls":3},{"$f":"SUM(F9:F11)","v":0},{"$f":"SUM(G9:G11)","v":0},{"$f":"SUM(H9:H11)","v":0}]
[null," - Taxi",{"$nulls":3},{"$f":"D9*E9","v":0},{"$f":"F9*I9","v":0},{"$f":"F9+G9","v":0},{"v":0.1,"d":"10%"}]
[null," - Máy bay",{"$nulls":3},{"$f":"D10*E10","v":0},0,0,{"v":0.1,"d":"10%"}]
[null," - Tàu",{"$nulls":3},0,0,0,{"v":0.1,"d":"10%"}]
[2,"Chi phí ăn, ở",{"$nulls":3},0,0,0,{"v":0.1,"d":"10%"}]
[3,"Chi phí đào tạo",{"$nulls":3},0,0,0,{"v":0,"d":"0%"}]
[4,"Chi phí tài liệu học tập",{"$nulls":3},0,0,0,{"v":0.1,"d":"10%"}]
[5,"Chi phí chuyên gia giảng dạy",{"$nulls":3},0,0,0,{"v":0.1,"d":"10%"}]
[null,"...",{"$nulls":4},0,0,{"v":0.1,"d":"10%"}]
["II","Chi phí khác",{"$nulls":3},0,0,0,{"v":0.1,"d":"10%"}]
["III","Chi phí chung, chi phí quản lý",{"$nulls":3},0,0,0,{"v":0.1,"d":"10%"}]
["IV","Chi phí dự phòng",{"$nulls":3},0,0,0,{"v":0.1,"d":"10%"}]
[]
[null,"Tổng cộng [I + II + ... + III]:",{"$nulls":3},{"$f":"F7+F17+F18+F19","v":0},{"$f":"G7+G17+G18+G19","v":0},{"$f":"H7+H17+H18+H19","v":0}]
[null,"LÀM TRÒN (Gdtcg):",{"$nulls":3},{"$f":"ROUND(F21,-3)","v":0},{"$f":"ROUND(G21,-3)","v":0},{"$f":"ROUND(H21,-3)","v":0}]

{"sheet":"Hang muc TB","index":32,"n_rows":12,"n_cols":8,"rows_kept":12}
["TỔNG HỢP DỰ TOÁN LẮP ĐẶT THIẾT BỊ CÁC HẠNG MỤC"]
[{"$f":"'Bia1'!D42&'Bia1'!E42","v":"CÔNG TRÌNH: NHÀ BIỆT THỰ GXD"}]
[{"$f":"'Bia2'!D43&'Bia2'!E43","v":"HẠNG MỤC: ĐỔI BẢNG MÃ FONT RẤT ĐƠN GIẢN TRONG DỰ TOÁN GXD"}]
[{"$nulls":7},"ĐVT: đồng"]
["STT","HẠNG MỤC","GIÁ TRỊ LẮP ĐẶT THIẾT BỊ TRƯỚC THUẾ","THUẾ GTGT","GIÁ TRỊ LẮP ĐẶT THIẾT BỊ SAU THUẾ","CHI PHÍ XÂY DỰNG NHÀ TẠM","TỔNG CỘNG","KÝ HIỆU"]
[null,{"$f":"'Bia2'!E12","v":"NHÀ BIỆT THỰ GXD"},{"$f":"'Lap dat'!D21","v":0},{"$f":"'Lap dat'!D22","v":0},{"$f":"'Lap dat'!D23","v":0},{"$f":"'Lap dat'!D24","v":0},{"$f":"'Lap dat'!D25","v":0}]
[{"$nulls":6},{"$f":"SUM(C7:F7)","v":0}]
[{"$nulls":6},0]
[{"$nulls":6},0]
[{"$nulls":6},0]
[{"$nulls":6},0]
[null,"TỔNG CỘNG",{"$f":"SUM(C6:C11)","v":0},0,0,0,{"$f":"SUM(G6:G11)","v":0},"Gld"]

{"sheet":"Lap dat","index":33,"n_rows":35,"n_cols":7,"rows_kept":35}
["BẢNG TỔNG HỢP DỰ TOÁN CHI PHÍ LẮP ĐẶT THIẾT BỊ"]
[{"$f":"'Bia1'!D42&'Bia1'!E42","v":"CÔNG TRÌNH: NHÀ BIỆT THỰ GXD"}]
[{"$f":"'Bia2'!D43&'Bia2'!E43","v":"HẠNG MỤC: ĐỔI BẢNG MÃ FONT RẤT ĐƠN GIẢN TRONG DỰ TOÁN GXD"}]
[{"$nulls":4},"ĐVT: đồng"]
["STT","KHOẢN MỤC CHI PHÍ","CÁCH TÍNH","GIÁ TRỊ","KÝ HIỆU","HS1","HS2"]
[null,"CHI PHÍ THEO ĐƠN GIÁ"]
[null,"Chi phí vật liệu",null,{"$f":"'Dutoan lap dat'!L28+'Dutoan lap dat'!M28","v":0},"A"]
[null,"Chênh lệch vật liệu",null,null,"CLVL"]
[null,"Chi phí nhân công",null,{"$f":"'Dutoan lap dat'!N28","v":0},"B"]
[null,"Chênh lệch nhân công",null,null,"CLNC"]
[null,"Chi phí máy xây dựng",null,{"$f":"'Dutoan lap dat'!O28","v":0},"C"]
[null,"Chênh lệch máy xây dựng",null,null,"CLM"]
["I","CHI PHÍ TRỰC TIẾP"]
[1,"Chi phí vật liệu",{"$f":"CPVLgld","v":"A*1"},{"$f":"IF(F14=0,D7+D8,(D7+D8)*F14)","v":0},"VL",{"$f":"ROUND(Ts!C12,3)","v":1}]
[2,"Chi phí nhân công",{"$f":"CPNCgld","v":"B*1"},{"$f":"IF(F15=0,D9+D10,IF(D10<>0,IF(G15<>0,D9*F15*G15+D10,D9*F15+D10),IF(G15<>0,D9*F15*G15,D9*F15)))","v":0},"NC",{"$f":"ROUND(Ts!C13,3)","v":1}]
[3,"Chi phí máy thi công",{"$f":"CPMTCgld","v":"C*1"},{"$f":"IF(F16=0,D11+D12,IF(G16<>0,D11*F16*G16+D12,D11*F16+D12))","v":0},"M",{"$f":"ROUND(Ts!C14,3)","v":1}]
[4,"Chi phí trực tiếp khác",{"$f":"\"(VL+NC+M)*\"&F17&\"%\"","v":"(VL+NC+M)*2,5%"},{"$f":"(D14+D15+D16)*F17%","v":0},"TT",{"$f":"Ts!C15","v":2.5}]
[null,"Chi phí trực tiếp","VL+NC+M+TT",{"$f":"SUM(D14:D17)","v":0},"T"]
["II","CHI PHÍ CHUNG",{"$f":"\"T * \"&F19&\"%\"","v":"T * 6,5%"},{"$f":"D18*F19%","v":0},"C",{"$f":"Ts!C16","v":6.5}]
["III","THU NHẬP CHỊU THUẾ TÍNH TRƯỚC",{"$f":"\"(T+C) * \"&F20&\"%\"","v":"(T+C) * 5,5%"},{"$f":"(D18+D19)*F20%","v":0},"TL",{"$f":"Ts!C17","v":5.5}]
[null,"Chi phí lắp đặt thiết bị trước thuế","T+C+TL",{"$f":"D18+D19+D20","v":0},"G"]
["IV","THUẾ GIÁ TRỊ GIA TĂNG","G*TGTGT-XD",{"$f":"D21*F22%","v":0},"GTGT",{"$f":"Ts!C18","v":10}]
[null,"Chi phí lắp đặt thiết bị sau thuế","G + GTGT",{"$f":"D21+D22","v":0},"GLD"]
["V","CHI PHÍ XÂY DỰNG NHÀ TẠM TẠI HIỆN TRƯỜNG ĐỂ Ở VÀ ĐIỀU HÀNH THI CÔNG","G*tỷ lệ*(1+TGTGT-XD)",{"$f":"D23*F24%","v":0},"GXDNT",{"$f":"Ts!C19","v":1}]
[null,"TỔNG CỘNG","GLD + GXDNT",{"$f":"D23+D24","v":0}]
[null,"LÀM TRÒN",null,{"$f":"ROUND(D25,-3)","v":0}]
[]
[]
[]
[null,"NGƯỜI LẬP","NGƯỜI CHỦ TRÌ"]
[]
[]
[]
[]
[null,null,"Chứng chỉ KS định giá XD hạng …, số …"]

{"sheet":"Dutoan lap dat","index":34,"n_rows":29,"n_cols":23,"rows_kept":29,"merged":[[4,0,5,0],[4,1,5,1],[4,2,5,2],[4,3,5,3],[4,4,5,4],[4,5,5,5],[4,6,5,6],[4,15,5,15],[4,19,5,19],[4,20,5,20],[4,21,5,21],[4,22,5,22]]}
["BẢNG DỰ TOÁN CHI PHÍ LẮP ĐẶT THIẾT BỊ"]
[{"$f":"'Bia1'!D42&'Bia1'!E42","v":"CÔNG TRÌNH: NHÀ BIỆT THỰ GXD"}]
[{"$f":"'Bia2'!D43&'Bia2'!E43","v":"HẠNG MỤC: ĐỔI BẢNG MÃ FONT RẤT ĐƠN GIẢN TRONG DỰ TOÁN GXD"}]
[{"$nulls":14},"ĐVT: đồng"]
["STT","MÃ VỮA","MÃ HIỆU ĐỊNH MỨC","MÃ HIỆU ĐƠN GIÁ","NỘI DUNG CÔNG VIỆC","ĐƠN VỊ","KHỐI LƯỢNG","ĐƠN GIÁ",{"$nulls":3},"THÀNH TIỀN",{"$nulls":3},"SỐ BỘ PHẬN GIỐNG NHAU","KÍCH THƯỚC",null,null,"HỆ SỐ","K.L MỘT BỘ PHẬN","K.L TOÀN BỘ PHẬN","GHI CHÚ"]
[{"$nulls":7},"VẬT LIỆU","VẬT LIỆU P","NHÂN CÔNG","MÁY","VẬT LIỆU","VẬT LIỆU P","NHÂN CÔNG","MÁY",null,"DÀI","RỘNG","CAO (sâu)"]
["[1]","[1a]","[1b]","[2]","[3]","[4]","[5]","[6]","[6']","[7]","[8]","[9]=[5]*[6]","[9']=[5]*[6']","[10]=[5]*[7]","[11]=[5]*[8]","[5]","[6]","[6']","[7]","[8]","[9]","[10]","[11]"]
{"$rows_empty":20}
[{"$nulls":3},"TC","Cộng",{"$nulls":6},{"$f":"SUM(L8:L27)","v":0},{"$f":"SUM(M8:M27)","v":0},{"$f":"SUM(N8:N27)","v":0},{"$f":"SUM(O8:W27)","v":0}]
[{"$nulls":11},"A","Ap","B","C"]

{"sheet":"Don gia lap dat","index":35,"n_rows":6,"n_cols":26,"rows_kept":6}
["BẢNG PHÂN TÍCH ĐƠN GIÁ CHI TIẾT LẮP ĐẶT THIẾT BỊ",{"$nulls":12},"VL","NC","M","TT","C","TL","GTGT","GXDNT","Cnc","Gpa","Gbc","Gnt","GDP"]
[{"$f":"'Bia1'!D42&'Bia1'!E42","v":"CÔNG TRÌNH: NHÀ BIỆT THỰ GXD"},{"$nulls":12},{"$f":"'CP xay dung'!F14","v":1},{"$f":"'CP xay dung'!F15","v":1},{"$f":"'CP xay dung'!F16","v":1},{"$f":"'CP xay dung'!F17","v":2.5},{"$f":"'CP xay dung'!F19","v":6.5},{"$f":"'CP xay dung'!F20","v":5.5},{"$f":"'CP xay dung'!F22","v":10},{"$f":"'CP xay dung'!F24","v":1},{"$f":"Ts!H26*100","v":51},{"$f":"Ts!C20","v":5},5,5,10]
[{"$f":"'Bia2'!D43&'Bia2'!E43","v":"HẠNG MỤC: ĐỔI BẢNG MÃ FONT RẤT ĐƠN GIẢN TRONG DỰ TOÁN GXD"}]
[{"$nulls":10},"ĐVT: đồng"]
["STT","MÃ VỮA","MÃ HiỆU ĐỊNH MỨC","MÃ HIỆU\nĐƠN GIÁ","MSVT","TÊN CÔNG VIỆC / THÀNH PHẦN HAO PHÍ","ĐƠN VỊ","ĐỊNH MỨC\nHAO PHÍ","ĐƠN GIÁ","HỆ SỐ","THÀNH TIỀN","HAO PHÍ"]
["[1]","[1a]","[1b]","[2]","[3]","[4]","[5]","[6]","[7]","[8]","[9]","[9']"]

{"sheet":"TH&Chenh lech LD","index":36,"n_rows":6,"n_cols":9,"rows_kept":6}
["BẢNG TỔNG HỢP VÀ TÍNH CHÊNH LỆCH VẬT TƯ LẮP ĐẶT THIẾT BỊ"]
[{"$f":"'Bia1'!D42&'Bia1'!E42","v":"CÔNG TRÌNH: NHÀ BIỆT THỰ GXD"}]
[{"$f":"'Bia2'!D43&'Bia2'!E43","v":"HẠNG MỤC: ĐỔI BẢNG MÃ FONT RẤT ĐƠN GIẢN TRONG DỰ TOÁN GXD"}]
[{"$nulls":8},"ĐVT: đồng"]
["STT","MSVT","TÊN VẬT TƯ","ĐƠN VỊ","KHỐI LƯỢNG","GIÁ VẬT TƯ GỐC","GIÁ VẬT TƯ TẠI THỜI ĐIỂM LẬP DỰ TOÁN","CHÊNH LỆCH","THÀNH TIỀN"]
["[1]","[2]","[3]","[4]","[5]","[6]","[7]","[8]=[7]-[6]","[9]=[5]*[8]"]

{"sheet":"VLSG TB","index":37,"n_rows":17,"n_cols":9,"rows_kept":17,"hidden":true}
["BẢNG GIÁ TRỊ CHÊNH LỆCH VẬT LIỆU TÍNH VÀO SAU CHI PHÍ LẮP ĐẶT THIẾT BỊ TRƯỚC THUẾ"]
[{"$f":"'Bia1'!D42&'Bia1'!E42","v":"CÔNG TRÌNH: NHÀ BIỆT THỰ GXD"}]
[{"$f":"'Bia2'!D43&'Bia2'!E43","v":"HẠNG MỤC: ĐỔI BẢNG MÃ FONT RẤT ĐƠN GIẢN TRONG DỰ TOÁN GXD"}]
[]
["STT","MSVT","TÊN VẬT LIỆU","ĐƠN VỊ","KHỐI LƯỢNG","GIÁ QUY VỀ","GIÁ THỰC TẾ","CHÊNH LỆCH","THÀNH TIỀN"]
["[1]","[2]","[3]","[4]","[5]","[6]","[7]","[8]","[9]"]
{"$rows_empty":8}
["Ghi chú:"]
["Giá trị chênh lệch được tính vào sau giá trị dự toán xây dựng trước thuế trong bảng tổng hợp dự toán chi phí xây dựng (chèn thêm 1 dòng)."]
["Xem thêm Thông tư số 17/2000/TT-BXD của Bộ Xây dựng."]

{"sheet":"VL hien truong LD","index":38,"n_rows":7,"n_cols":23,"rows_kept":7,"merged":[[4,0,5,0],[4,1,5,1],[4,2,5,2],[4,3,5,3],[4,4,5,4],[4,5,5,5],[4,6,5,6],[4,7,5,7],[4,8,5,8],[4,9,5,9],[4,10,5,10],[4,11,5,11],[4,12,5,12],[4,19,5,19],[4,20,5,20],[4,21,5,21],[4,22,5,22]]}
["BẢNG TÍNH GIÁ VẬT LIỆU ĐẾN HIỆN TRƯỜNG LẮP ĐẶT THIẾT BỊ"]
[{"$f":"'Bia1'!D42&'Bia1'!E42","v":"CÔNG TRÌNH: NHÀ BIỆT THỰ GXD"}]
[{"$f":"'Bia2'!D43&'Bia2'!E43","v":"HẠNG MỤC: ĐỔI BẢNG MÃ FONT RẤT ĐƠN GIẢN TRONG DỰ TOÁN GXD"}]
[{"$nulls":21},"ĐVT: đồng"]
["STT","MSVT","LOẠI VẬT LIỆU","ĐƠN VỊ","KHỐI LƯỢNG","TRỌNG LƯỢNG ĐƠN VỊ","LOẠI ĐƯỜNG","CỰ LY (Km)","GIÁ CƯỚC","HỆ SỐ BẬC HÀNG","HỆ SỐ ĐỔ BEN","CƯỚC TĂNG THÊM","CHI PHÍ VẬN CHUYỂN","CHI PHÍ TRUNG CHUYỂN",{"$nulls":5},"CHI PHÍ BỐC XẾP","GIÁ GỐC\n(GIÁ MUA)","GIÁ ĐẾN HIỆN TRƯỜNG","NGUỒN MUA"]
[null,"MÃ HIỆU",{"$nulls":11},"Bốc xếp","VC bộ khởi điểm","VC bộ 10m tiếp theo","VC phương tiện thô sơ kđiểm","VC phương tiện thô sơ 10m tiếp","Cộng chi phí  trung chuyển"]
["[1]","[2]","[3]","[4]","[5]","[6]","[7]","[8]","[9]","[10]","[11]","[12]","[13]","[14]","[15]","[16]","[17]","[18]","[19]","[20]","[21]","[22]","[23]"]

{"sheet":"PLV lap dat","index":39,"n_rows":6,"n_cols":8,"rows_kept":6}
["BẢNG PHỤ LỤC VỮA LẮP ĐẶT THIẾT BỊ"]
[{"$f":"'Bia1'!D42&'Bia1'!E42","v":"CÔNG TRÌNH: NHÀ BIỆT THỰ GXD"}]
[{"$f":"'Bia2'!D43&'Bia2'!E43","v":"HẠNG MỤC: ĐỔI BẢNG MÃ FONT RẤT ĐƠN GIẢN TRONG DỰ TOÁN GXD"}]
[{"$nulls":7},"ĐVT: đồng"]
["STT","MÃ VỮA","MSVT","LOẠI VẬT LIỆU","ĐƠN VỊ","ĐỊNH MỨC","ĐƠN GIÁ","THÀNH TIỀN"]
["[1]","[2]","[3]","[4]","[5]","[6]","[7]","[8]=[6]*[7]"]

{"sheet":"Nhan cong LD","index":40,"n_rows":15,"n_cols":14,"rows_kept":15,"merged":[[6,3,6,4],[7,3,7,4],[8,3,8,4],[11,0,13,0],[11,1,13,1],[11,2,13,2],[11,3,13,3],[11,4,13,4],[11,5,13,5],[11,6,13,6],[11,13,13,13]]}
["BẢNG LƯƠNG NHÂN CÔNG LẮP ĐẶT THIẾT BỊ"]
[{"$f":"'Bia1'!D42&'Bia1'!E42","v":"CÔNG TRÌNH: NHÀ BIỆT THỰ GXD"}]
[{"$f":"'Bia2'!D43&'Bia2'!E43","v":"HẠNG MỤC: ĐỔI BẢNG MÃ FONT RẤT ĐƠN GIẢN TRONG DỰ TOÁN GXD"}]
[" - Mức lương tối thiểu chung (LTTC):",{"$nulls":4},{"$f":"LTTC","v":{"v":1050000,"d":"1,050,000"}},"đồng/tháng"]
[" - Mức lương tối thiểu vùng (LTTV):",{"$nulls":4},{"$f":"LTTV","v":{"v":2000000,"d":"2,000,000"}},"đồng/tháng"]
[" - Các khoản phụ cấp theo LTT:"]
[null,"Phụ cấp lưu động:",null,{"$f":"Ts!C24","v":{"v":0.2,"d":"20% LTTC"}},null,{"$f":"$F$4*luudong","v":{"v":210000,"d":"210,000"}},"đồng/tháng"]
[null,"Phụ cấp khu vực:",null,{"$f":"Ts!C28","v":{"v":0,"d":"0% LTTC"}},null,{"$f":"$F$4*khuvuc","v":0},"đồng/tháng"]
[null,"Phụ cấp độc hại:",null,{"$f":"Ts!C30","v":{"v":0,"d":"0% LTTC"}},null,{"$f":"$F$4*dochai","v":0},"đồng/tháng"]
[null,"Tổng các phụ cấp theo LTT:",{"$nulls":3},{"$f":"SUM(F7:F9)","v":{"v":210000,"d":"210,000"}},"đồng/tháng"]
[]
["STT","MSVT","LOẠI NHÂN CÔNG","CẤP BẬC","HỆ SỐ LƯƠNG (HSL)","LƯƠNG CẤP BẬC (LCB=\nHSLxLTTV) (đ/tháng)","TỔNG CÁC KHOẢN PHỤ CẤP THEO LTT","PHỤ CẤP THEO LƯƠNG CẤP BẬC (LCB)",{"$nulls":5},"TỔNG L+PC (đ/công)"]
[{"$nulls":6},"Lưu động","Lương phụ","Khoán trực tiếp","Không ổn định SX","Thu hút","Đặc biệt","Ca đêm"]
[{"$nulls":7},{"$f":"Ts!$C$25","v":{"v":0.12,"d":"12% LCB"}},{"$f":"Ts!$C$26","v":{"v":0.04,"d":"4% LCB"}},{"$f":"Ts!$C$27","v":{"v":0,"d":"0% LCB"}},{"$f":"thuhut","v":{"v":0,"d":"0% LCB"}},{"$f":"Ts!$C$31","v":{"v":0,"d":"0% LCB"}},{"$f":"Ts!$C$32","v":{"v":0,"d":"0% LCB"}}]
["[1]","[2]","[3]","[4]","[5]","[6]","[7]","[8]","[9]","[10]","[11]","[11a]","[11b]","[12]"]

{"sheet":"Gia ca may LD","index":41,"n_rows":7,"n_cols":40,"rows_kept":7,"merged":[[4,0,5,0],[4,1,5,1],[4,2,5,2],[4,3,5,3],[4,4,4,7],[4,8,5,9],[4,10,5,10],[4,11,5,11],[4,12,5,12],[4,13,5,13],[4,14,5,14],[4,15,5,15],[4,16,5,16],[4,17,5,17],[4,18,5,18],[4,19,4,21],[4,22,5,22],[4,23,5,23],[4,24,5,24],[4,25,5,25],[4,26,5,26],[4,27,5,27],[4,28,5,28],[4,29,5,29],[4,30,5,30],[4,31,5,31],[4,32,5,32]]}
["BẢNG GIÁ CA MÁY VÀ THIẾT BỊ THI CÔNG LẮP ĐẶT THIẾT BỊ",{"$nulls":33},"Xăng (đ/lít)","Dầu Diezel (đ/lít)","Điện (đ/kw)","Ma dút (đ/lít)","Dầu hỏa (đ/lít)","Dầu DO (đ/lít)"]
[{"$f":"'Bia1'!D42&'Bia1'!E42","v":"CÔNG TRÌNH: NHÀ BIỆT THỰ GXD"},{"$nulls":32},"GNL GCM đp:",{"$f":"xang","v":{"v":19000,"d":"19,000"}},{"$f":"diezel","v":{"v":18955,"d":"18,955"}},{"$f":"dien","v":{"v":1242,"d":"1,242"}},{"$f":"mazut","v":{"v":13548,"d":"13,548"}},{"$f":"Ts!C38","v":0},{"$f":"Ts!C39","v":0}]
[{"$f":"'Bia2'!D43&'Bia2'!E43","v":"HẠNG MỤC: ĐỔI BẢNG MÃ FONT RẤT ĐƠN GIẢN TRONG DỰ TOÁN GXD"},{"$nulls":32},"GNC GCM ht:",{"$f":"Ts!C42","v":{"v":19909,"d":"19,909"}},{"$f":"Ts!C43","v":{"v":19545,"d":"19,545"}},{"$f":"Ts!C47","v":{"v":2061,"d":"2,061"}},{"$f":"Ts!C44","v":{"v":14548,"d":"14,548"}},{"$f":"Ts!C45","v":0},{"$f":"Ts!C46","v":0}]
[{"$nulls":18},"ĐVT: đồng"]
["STT","MSVT","LOẠI MÁY, THIẾT BỊ","SỐ CA/ NĂM","ĐỊNH MỨC KHẤU HAO, SỬA CHỮA, CHI PHÍ KHÁC / NĂM (%/GIÁ TÍNH KH)",{"$nulls":3},"ĐỊNH MỨC TIÊU HAO NHIÊN LIỆU, NĂNG LƯỢNG 1 CA (CNL)",null,"HỆ SỐ NHIÊN LIỆU PHỤ","THÀNH PHẦN CẤP BẬC THỢ ĐIỀU KHIỂN MÁY","NGUYÊN GIÁ (GIÁ TÍNH KHẤU HAO)","CHI PHÍ KHẤU HAO\n(CKH)","CHI PHÍ SỬA CHỮA\n(CSC)","CHI PHÍ NHIÊN LIỆU, NĂNG LƯỢNG\n(CNL)","CHI PHÍ TIỀN LƯƠNG\n(CTL)","CHI PHÍ KHÁC\n(CCPK)","GIÁ CA MÁY\n(CCM)","CHI PHÍ TRONG GCM TẠI THỜI ĐIỂM GỐC",null,null,"CHI PHÍ NHIÊN LIỆU, NĂNG LƯỢNG TẠI THỜI ĐIỂM GỐC","CHI PHÍ TIỀN LƯƠNG TẠI THỜI ĐIỂM GỐC","NGUYÊN GIÁ (GIÁ TÍNH KHẤU HAO) TẠI THỜI ĐIỂM GỐC","NGUYÊN GIÁ (GIÁ TÍNH KHẤU HAO) TẠI THỜI ĐIỂM ĐIỀU CHỈNH","GIÁ CA MÁY GỐC","CHI PHÍ NHIỀN LIỆU, NĂNG LƯỢNG TẠI THỜI ĐIỂM ĐIỀU CHỈNH","CHI PHÍ TIỀN LƯƠNG TẠI THỜI ĐIỂM ĐIỀU CHỈNH","HỆ SỐ ĐIỀU CHỈNH NGUYÊN GIÁ (K1)","HỆ SỐ ĐIỀU CHỈNH CHI PHÍ NHIÊN LIỆU, NĂNG LƯỢNG (K2)","HỆ SỐ ĐIỀU CHỈNH CHI PHÍ TIỀN LƯƠNG (K3)","GIÁ CA MÁY ĐIỀU CHỈNH (CCMĐC)"]
[{"$nulls":4},"Khấu hao","Hệ số thu hồi khi thanh lý","Sửa chữa","CP #",{"$nulls":11},"CP khấu hao","CP sửa chữa","CP khác"]
["[1]","[2]","[3]","[4]","[5]","[6]","[7]","[8]","[9]",null,"[10]","[11]","[12]","[13]","[14]","[15]","[16]","[17]","[18]","[6]","[7]","[8]","[9]","[10]","[11]","[12]","[12]","[13]","[14]","[15]","[16]","[17]","[18]"]

{"sheet":"NhienlieuTB","index":42,"n_rows":14,"n_cols":13,"rows_kept":14,"hidden":true,"merged":[[4,0,5,0],[4,1,5,1],[4,2,5,2],[4,3,5,3],[4,4,5,4]]}
["BẢNG TỔNG HỢP HAO PHÍ NHIÊN LIỆU, NĂNG LƯỢNG PHẦN LẮP ĐẶT THIẾT BỊ"]
[{"$f":"'Bia1'!D42&'Bia1'!E42","v":"CÔNG TRÌNH: NHÀ BIỆT THỰ GXD"}]
[{"$f":"'Bia1'!D43&'Bia1'!E43","v":"HẠNG MỤC: ĐỔI BẢNG MÃ FONT RẤT ĐƠN GIẢN TRONG DỰ TOÁN GXD"}]
[{"$nulls":12},"ĐVT: đồng"]
["STT","MSVT","TÊN MÁY / THIẾT BỊ THI CÔNG","ĐVT","HAO PHÍ CA MÁY","ĐỊNH MỨC TIÊU HAO NHIÊN LIỆU, NĂNG LƯỢNG",{"$nulls":3},"TỔNG HAO PHÍ NHIÊN LIỆU, NĂNG LƯỢNG"]
[{"$nulls":5},"Xăng","Điện","Diezel","Dầu mazut","Xăng","Điện","Diezel","Dầu mazut"]
["[1]","[2]","[3]","[4]","[5]","[6]","[7]","[8]","[9]","[10]","[11]","[12]","[13]"]
[]
[]
[]
[]
[]
[]
["Tổng cộng",{"$nulls":8},{"$f":"SUM(J8:J13)","v":0},{"$f":"SUM(K8:K13)","v":0},{"$f":"SUM(L8:L13)","v":0},{"$f":"SUM(M8:M13)","v":0}]

{"sheet":"Vật tư điều chỉnh thiết bị","index":43,"n_rows":6,"n_cols":9,"rows_kept":6,"hidden":true}
["BẢNG GIÁ TRỊ VẬT TƯ"]
[{"$f":"'Bia1'!D42&'Bia1'!E42","v":"CÔNG TRÌNH: NHÀ BIỆT THỰ GXD"}]
[{"$f":"'Bia1'!D43&'Bia1'!E43","v":"HẠNG MỤC: ĐỔI BẢNG MÃ FONT RẤT ĐƠN GIẢN TRONG DỰ TOÁN GXD"}]
[{"$nulls":6},"Đơn vị tính: VND"]
["STT","MSVT","TÊN VẬT TƯ","ĐƠN VỊ","KHỐI LƯỢNG","ĐƠN GIÁ","THÀNH TIỀN","TỶ TRỌNG CHI PHÍ VL, NC, MTC CT1","TỶ TRỌNG CHI PHÍ LOẠI VL, NC, NHÓM MTC CHỦ YẾU CT1"]
["[1]","[2]","[3]","[4]","[5]","[6]","[7]","[8]","[9]"]

{"sheet":"Số liệu điều chỉnh HĐ thiết bị","index":44,"n_rows":60,"n_cols":6,"rows_kept":60,"hidden":true,"merged":[[2,2,2,4],[3,2,3,4]]}
[null,"BẢNG TỶ TRỌNG CHI PHÍ"]
[]
[null,"STT","NỘI DUNG",null,null,"GIÁ TRỊ"]
[null,"[1]","[2]",null,null,"[3]"]
[null,"I","Vốn đầu tư xây dựng công trình (GXDCT)",null,null,{"$f":"'Tong hop kinh phi'!G16","v":{"v":128535781.68804762,"d":"128,535,782"}}]
[null,1,"Chi phí xây dựng (GXD)",null,null,{"$f":"'Tong hop kinh phi'!G7","v":{"v":109606069.10259347,"d":"109,606,069"}}]
[null,2,"Chi phí thiết bị (GTB)",null,null,{"$f":"SUM(F8:F10)","v":0}]
[null,null," +  Chi phí mua sắm thiết bị (Gmstb)",null,null,{"$f":"'TH CP thiet bi'!F7","v":0}]
[null,null," +  Chi phí đào tạo và chuyển giao công nghệ (Gdtcg)",null,null,{"$f":"'TH CP thiet bi'!F8","v":0}]
[null,null," +  Chi phí lắp đặt thiết bị và thí nghiệm, hiệu chỉnh (Gld)",null,null,{"$f":"'TH CP thiet bi'!F9","v":0}]
[null,3,"Chi phí khác (GCPK)",null,null,{"$f":"F5-F6-F7","v":{"v":18929712.58545415,"d":"18,929,713"}}]
[null,null," +  Chi phí khảo sát xây dựng",null,null,{"$f":"'Tong hop kinh phi'!#REF!","v":{"$error":"#REF!"}}]
[null,null," +  Chi phí thiết kế công trình",null,null,{"$f":"SUM('Tong hop kinh phi'!#REF!)","v":{"$error":"#REF!"}}]
[null,null," +  Chi phí quản lý dự án",null,null,{"$f":"'Tong hop kinh phi'!G12","v":{"v":2514961.0764995078,"d":"2,514,961"}}]
[null,"II","Các tỷ trọng chi phí theo cơ cấu chi phí và yếu tố chi phí"]
[null,1,"Tỷ trọng chi phí xây dựng (PXD)",null,null,{"$f":"IF(ISERROR(F6/$F$5),0,F6/$F$5)","v":{"v":0.8527280704497058,"d":"85.27%"}}]
[null,2,"Tỷ trọng chi phí thiết bị (PTB)",null,null,{"$f":"IF(ISERROR(F7/$F$5),0,F7/$F$5)","v":{"v":0,"d":"0.00%"}}]
[null,null,"Trong đó:"]
[null,null," +  Tỷ trọng chi phí mua sắm thiết bị  (Gmstb)",null,null,{"$f":"IF(ISERROR(F8/$F$7),0,F8/$F$7)","v":{"v":0,"d":"0.00%"}}]
[null,null," +  Tỷ trọng chi phí đào tạo và chuyển giao công nghệ (Gdtcg)",null,null,{"$f":"IF(ISERROR(F9/$F$7),0,F9/$F$7)","v":{"v":0,"d":"0.00%"}}]
[null,null," +  Tỷ trọng chi phí lắp đặt thiết bị và thí nghiệm, hiệu chỉnh (Gld)",null,null,{"$f":"IF(ISERROR(F10/$F$7),0,F10/$F$7)","v":{"v":0,"d":"0.00%"}}]
[null,3,"Tỷ trọng chi phí khác (PCPK)",null,null,{"$f":"IF(ISERROR(F11/$F$5),0,F11/$F$5)","v":{"v":0.14727192955029425,"d":"14.73%"}}]
[null,null,"Trong đó:"]
[null,null," +  Tỷ trọng chi phí khảo sát xây dựng:",null,null,{"$f":"IF(ISERROR(F12/$F$11),0,F12/$F$11)","v":{"v":0,"d":"0.00%"}}]
[null,null," +  Tỷ trọng chi phí thiết kế công trình:",null,null,{"$f":"IF(ISERROR(F13/$F$11),0,F13/$F$11)","v":{"v":0,"d":"0.00%"}}]
[null,null," +  Tỷ trọng chi phí quản lý dự án: ",null,null,{"$f":"IF(ISERROR(F14/$F$11),0,F14/$F$11)","v":{"v":0.13285785851984028,"d":"13.29%"}}]
[]
[]
[]
[null,"BẢNG SỐ LIỆU ĐIỀU CHỈNH HỢP ĐỒNG"]
[null,{"$f":"'Bia1'!D42&'Bia1'!E42","v":"CÔNG TRÌNH: NHÀ BIỆT THỰ GXD"}]
[null,{"$f":"'Bia2'!D43&'Bia2'!E43","v":"HẠNG MỤC: ĐỔI BẢNG MÃ FONT RẤT ĐƠN GIẢN TRONG DỰ TOÁN GXD"}]
[]
[null," - Các yếu tố điều chỉnh"]
[null,null," + Chí phí vật liệu (VL)",null,1]
[null,null," + Chí phí nhân công (NC)",null,1]
[null,null," + Chí phí máy thi công (MTC)",null,1]
[null,null," + Tỷ lệ tạm ứng  của nhà đầu tư (u)",null,0]
[null,null," + Giá hợp đồng (G)",null,0]
[null,null," + Chi phí điều chỉnh (T)",null,{"$f":"E35+E36+E37","v":3}]
[]
[null,"Trường hợp tổng quát"]
[]
[null,"STT","HỆ SỐ CỐ ĐỊNH \na(%)","TỶ TRỌNG NHÂN CÔNG\nb(%)","TỶ TRỌNG MÁY\nc(%)","TỶ TRỌNG VẬT LiỆU\nd(%)"]
[null,1,"a=1-(b+c+d)","b=NC/G","c=MTC/G","d=VL/G"]
[null,2,{"$f":"1-(D46+E46+F46)","v":{"v":1,"d":"100.00%"}},{"$f":"IF(E39=0,0,E36/E39)","v":{"v":0,"d":"0.00%"}},{"$f":"IF(E39=0,0,E37/E39)","v":{"v":0,"d":"0.00%"}},{"$f":"IF(E39=0,0,E35/E39)","v":{"v":0,"d":"0.00%"}}]
[]
[]
[null,"Trường hợp xét đến tỷ lệ tạm ứng hợp đồng của Chủ đầu tư cho nhà thầu"]
[]
[null,"STT","HỆ SỐ CỐ ĐỊNH \na(%)","TỶ TRỌNG NHÂN CÔNG\nb(%)","TỶ TRỌNG MÁY\nc(%)","TỶ TRỌNG VẬT LiỆU\nd(%)"]
[null,1,"a=1-T/G*(1-u)","b=NC/T*(1-a)","c=MTC/T*(1-a)","d=VL/T*(1-a)"]
[null,2,{"$f":"IF(E39=0,0,1-E40/E39*(1-E38))","v":{"v":0,"d":"0.00%"}},{"$f":"E36/E40*(1-C53)","v":{"v":0.3333333333333333,"d":"33.33%"}},{"$f":"E37/E40*(1-C53)","v":{"v":0.3333333333333333,"d":"33.33%"}},{"$f":"E35/E40*(1-C53)","v":{"v":0.3333333333333333,"d":"33.33%"}}]
[]
[]
[null,"Trường hợp xác định trước hệ số cố định"]
[]
[null,"STT","HỆ SỐ CỐ ĐỊNH \na(%)","TỶ TRỌNG NHÂN CÔNG\nb(%)","TỶ TRỌNG MÁY\nc(%)","TỶ TRỌNG VẬT LiỆU\nd(%)"]
[null,1,null,"b=NC/T*(1-a)","c=MTC/T*(1-a)","d=VL/T*(1-a)"]
[null,2,null,{"$f":"E36/E40*(1-C60)","v":{"v":0.3333333333333333,"d":"33.33%"}},{"$f":"E37/E40*(1-C60)","v":{"v":0.3333333333333333,"d":"33.33%"}},{"$f":"E35/E40*(1-C60)","v":{"v":0.3333333333333333,"d":"33.33%"}}]

{"sheet":"Du thau LD","index":45,"n_rows":6,"n_cols":19,"rows_kept":6}
["BẢNG DỰ TOÁN DỰ THẦU LẮP ĐẶT THIẾT BỊ"]
[{"$f":"'Bia1'!D42&'Bia1'!E42","v":"CÔNG TRÌNH: NHÀ BIỆT THỰ GXD"}]
[{"$f":"'Bia2'!D43&'Bia2'!E43","v":"HẠNG MỤC: ĐỔI BẢNG MÃ FONT RẤT ĐƠN GIẢN TRONG DỰ TOÁN GXD"}]
[]
["STT","MÃ HIỆU","NỘI DUNG CÔNG VIỆC","ĐƠN VỊ","KHỐI LƯỢNG","ĐƠN GIÁ","THÀNH TIỀN","ĐGVL","ĐGVLP","ĐGNC","ĐGM","TT","T","C","TL","G","GTGT","GXDNT","GXD"]
["[1]","[2]","[3]","[4]","[5]","[6]","[7]=[5]*[6]"]

{"sheet":"VCLC TB","index":46,"n_rows":6,"n_cols":5,"rows_kept":6,"hidden":true}
["BẢNG TỔNG HỢP VẬT TƯ VẬN CHUYỂN LÊN CAO"]
[{"$f":"'Bia1'!D42&'Bia1'!E42","v":"CÔNG TRÌNH: NHÀ BIỆT THỰ GXD"}]
[{"$f":"'Bia2'!D43&'Bia2'!E43","v":"HẠNG MỤC: ĐỔI BẢNG MÃ FONT RẤT ĐƠN GIẢN TRONG DỰ TOÁN GXD"}]
[]
["STT","MÃ HIỆU","TÊN VẬT TƯ","ĐƠN VỊ","KHỐI LƯỢNG"]
["[1]","[2]","[3]","[4]","[5]"]

{"sheet":"GVT TB","index":47,"n_rows":6,"n_cols":7,"rows_kept":6,"hidden":true}
["BẢNG GIÁ TRỊ VẬT TƯ LẮP ĐẶT THIẾT BỊ"]
[{"$f":"'Bia1'!D42&'Bia1'!E42","v":"CÔNG TRÌNH: NHÀ BIỆT THỰ GXD"}]
[{"$f":"'Bia2'!D43&'Bia2'!E43","v":"HẠNG MỤC: ĐỔI BẢNG MÃ FONT RẤT ĐƠN GIẢN TRONG DỰ TOÁN GXD"}]
[{"$nulls":6},"ĐVT: đồng"]
["STT","MÃ HIỆU","TÊN VẬT TƯ","ĐƠN VỊ","KHỐI LƯỢNG","ĐƠN GIÁ","THÀNH TIỀN"]
["[1]","[2]","[3]","[4]","[5]","[6]","[7]=[5]*[6]"]

{"sheet":"TDLD TB","index":48,"n_rows":6,"n_cols":10,"rows_kept":6,"hidden":true,"merged":[[4,0,5,0],[4,1,5,1],[4,2,5,2],[4,3,5,3],[4,4,5,4],[4,5,4,9]]}
["BẢNG TIẾN ĐỘ LẮP ĐẶT THIẾT BỊ"]
[{"$f":"'Bia1'!D42&'Bia1'!E42","v":"CÔNG TRÌNH: NHÀ BIỆT THỰ GXD"}]
[{"$f":"'Bia2'!D43&'Bia2'!E43","v":"HẠNG MỤC: ĐỔI BẢNG MÃ FONT RẤT ĐƠN GIẢN TRONG DỰ TOÁN GXD"}]
[]
["STT","MÃ HIỆU","NỘI DUNG CÔNG VIỆC","ĐƠN VỊ","HAO PHÍ NC","TIẾN ĐỘ LẮP ĐẶT THIẾT BỊ"]
[{"$nulls":5},"T1","T2","T3","T4","T5"]

{"sheet":"NhanCong","index":49,"n_rows":389,"n_cols":13,"rows_kept":389,"merged":[[11,0,13,0],[11,1,13,1],[11,2,13,2],[11,3,13,3],[11,4,13,4],[11,5,13,5],[11,12,13,12]]}
["BẢNG LƯƠNG NHÂN CÔNG XÂY DỰNG"]
[{"$f":"'Bia1'!D42&'Bia1'!E42","v":"CÔNG TRÌNH: NHÀ BIỆT THỰ GXD"}]
[{"$f":"'Bia1'!D43&'Bia1'!E43","v":"HẠNG MỤC: ĐỔI BẢNG MÃ FONT RẤT ĐƠN GIẢN TRONG DỰ TOÁN GXD"}]
[" - Mức lương tối thiểu chung (LTTC):",{"$nulls":3},{"$f":"LTTC","v":{"v":1050000,"d":"1,050,000"}},"đồng/tháng"]
[" - Mức lương tối thiểu vùng (LTTV):",{"$nulls":3},{"$f":"LTTV","v":{"v":2000000,"d":"2,000,000"}},"đồng/tháng"]
[" - Các khoản phụ cấp theo LTT:"]
[null,null,"Phụ cấp lưu động (20%LTTC)",null,null,{"$f":"$E$4*luudong","v":{"v":210000,"d":"210,000"}},"đồng/tháng"]
[null,null,"Phụ cấp khu vực (0%LTTC)",null,null,{"$f":"$E$4*khuvuc","v":0},"đồng/tháng"]
[null,null,"Phụ cấp độc hại (0%LTTC)",null,null,{"$f":"$E$4*dochai","v":0},"đồng/tháng"]
[null,null,"Tổng các phụ cấp theo LTT",null,null,{"$f":"SUM(F7:F9)","v":{"v":210000,"d":"210,000"}},"đồng/tháng"]
[]
["STT","MÃ HIỆU","CẤP BẬC","HỆ SỐ LƯƠNG (HSL)","LƯƠNG CẤP BẬC (LCB=\nHSLxLTTV) (đ/tháng)","TỔNG CÁC KHOẢN PHỤ CẤP THEO LTT","PHỤ CẤP THEO LƯƠNG CẤP BẬC (LCB)",{"$nulls":5},"TỔNG L+PC (đ/công)"]
[{"$nulls":5},"Lưu động","Lương phụ","Khoán trực tiếp","Không ổn định sản xuất","Thu hút","Đặc biệt","Ca đêm"]
[{"$nulls":6},{"v":0.12,"d":"12% LCB"},{"v":0.04,"d":"4% LCB"},{"v":0.1,"d":"10% LCB"},{"v":0,"d":"0% LCB"},{"v":0,"d":"0% LCB"},{"v":0,"d":"0% LCB"}]
["A.1.8. BẢNG LƯƠNG CÔNG NHÂN XDCB (THEO NGHỊ ĐỊNH 205/2004/NĐ-CP NGÀY 14/12/2004)"]
["Nhóm I"]
[null,"N1207",{"v":2,"d":"2.0"},{"v":1.83,"d":"1.830"},{"$f":"D17*LTTV","v":{"v":3660000,"d":"3,660,000"}},{"$f":"$F$10","v":{"v":210000,"d":"210,000"}},{"$f":"E17*luongphu","v":{"v":439200,"d":"439,200"}},{"$f":"E17*khoantructiep","v":{"v":146400,"d":"146,400"}},{"$f":"E17*KhongOndinhSX","v":0},{"$f":"E17*thuhut","v":0},0,null,{"$f":"ROUND(SUM(E17:L17)/26,0)","v":{"v":171369,"d":"171,369"}}]
[null,"N1257",2.5,1.995,{"v":3990000,"d":"3,990,000"},{"v":210000,"d":"210,000"},{"v":478800,"d":"478,800"},{"v":159600,"d":"159,600"},0,0,null,null,{"$f":"ROUND(SUM(E18:L18)/26,0)","v":{"v":186092,"d":"186,092"}}]
[null,"N1277",2.7,2.061,{"v":4122000,"d":"4,122,000"},{"v":210000,"d":"210,000"},{"v":494640,"d":"494,640"},{"v":164880,"d":"164,880"},0,0,null,null,{"v":191982,"d":"191,982"}]
[null,"N1307",{"v":3,"d":"3.0"},{"v":2.16,"d":"2.160"},{"v":4320000,"d":"4,320,000"},{"v":210000,"d":"210,000"},{"v":518400,"d":"518,400"},{"v":172800,"d":"172,800"},0,0,null,null,{"v":200815,"d":"200,815"}]
[null,"N1327",3.2,2.238,{"v":4476000,"d":"4,476,000"},{"v":210000,"d":"210,000"},{"v":537120,"d":"537,120"},{"v":179040,"d":"179,040"},0,0,null,null,{"v":207775,"d":"207,775"}]
[null,"N1337",3.3,2.277,{"v":4554000,"d":"4,554,000"},{"v":210000,"d":"210,000"},{"v":546480,"d":"546,480"},{"v":182160,"d":"182,160"},0,0,null,null,{"v":211255,"d":"211,255"}]
[null,"N1357",3.5,2.355,{"v":4710000,"d":"4,710,000"},{"v":210000,"d":"210,000"},{"v":565200,"d":"565,200"},{"v":188400,"d":"188,400"},0,0,null,null,{"v":218215,"d":"218,215"}]
[null,"N1377",3.7,2.433,{"v":4866000,"d":"4,866,000"},{"v":210000,"d":"210,000"},{"v":583920,"d":"583,920"},{"v":194640,"d":"194,640"},0,0,null,null,{"v":225175,"d":"225,175"}]
[null,"N1407",{"v":4,"d":"4.0"},{"v":2.55,"d":"2.550"},{"v":5100000,"d":"5,100,000"},{"v":210000,"d":"210,000"},{"v":612000,"d":"612,000"},{"v":204000,"d":"204,000"},0,0,null,null,{"v":235615,"d":"235,615"}]
[null,"N1437",4.3,{"v":2.6879999999999997,"d":"2.688"},{"v":5375999.999999999,"d":"5,376,000"},{"v":210000,"d":"210,000"},{"v":645119.9999999999,"d":"645,120"},{"v":215039.99999999997,"d":"215,040"},0,0,null,null,{"v":247929,"d":"247,929"}]
[null,"N1457",4.5,{"v":2.78,"d":"2.780"},{"v":5560000,"d":"5,560,000"},{"v":210000,"d":"210,000"},{"v":667200,"d":"667,200"},{"v":222400,"d":"222,400"},0,0,null,null,{"v":256138,"d":"256,138"}]
[null,"N1477",4.7,2.872,{"v":5744000,"d":"5,744,000"},{"v":210000,"d":"210,000"},{"v":689280,"d":"689,280"},{"v":229760,"d":"229,760"},0,0,null,null,{"v":264348,"d":"264,348"}]
[null,"N1507",{"v":5,"d":"5.0"},{"v":3.01,"d":"3.010"},{"v":6020000,"d":"6,020,000"},{"v":210000,"d":"210,000"},{"v":722400,"d":"722,400"},{"v":240800,"d":"240,800"},0,0,null,null,{"v":276662,"d":"276,662"}]
[null,"N1527",5.2,{"v":3.1199999999999997,"d":"3.120"},{"v":6239999.999999999,"d":"6,240,000"},{"v":210000,"d":"210,000"},{"v":748799.9999999999,"d":"748,800"},{"v":249599.99999999997,"d":"249,600"},0,0,null,null,{"v":286477,"d":"286,477"}]
[null,"N1557",5.5,3.285,{"v":6570000,"d":"6,570,000"},{"v":210000,"d":"210,000"},{"v":788400,"d":"788,400"},{"v":262800,"d":"262,800"},0,0,null,null,{"v":301200,"d":"301,200"}]
[null,"N1607",{"v":6,"d":"6.0"},{"v":3.56,"d":"3.560"},{"v":7120000,"d":"7,120,000"},{"v":210000,"d":"210,000"},{"v":854400,"d":"854,400"},{"v":284800,"d":"284,800"},0,0,null,null,{"v":325738,"d":"325,738"}]
[null,"N1707",{"v":7,"d":"7.0"},{"v":4.2,"d":"4.200"},{"v":8400000,"d":"8,400,000"},{"v":210000,"d":"210,000"},{"v":1008000,"d":"1,008,000"},{"v":336000,"d":"336,000"},0,0,null,null,{"v":382846,"d":"382,846"}]
["Nhóm II"]
[null,"N2207",{"v":2,"d":"2.0"},{"v":1.96,"d":"1.960"},{"$f":"D35*LTTV","v":{"v":3920000,"d":"3,920,000"}},{"v":210000,"d":"210,000"},{"$f":"E35*luongphu","v":{"v":470400,"d":"470,400"}},{"$f":"E35*khoantructiep","v":{"v":156800,"d":"156,800"}},{"$f":"E35*KhongOndinhSX","v":0},{"$f":"E35*thuhut","v":0},null,null,{"$f":"ROUND(SUM(E35:L35)/26,0)","v":{"v":182969,"d":"182,969"}}]
[null,"N2257",2.5,2.135,{"v":4270000,"d":"4,270,000"},{"v":210000,"d":"210,000"},{"v":512400,"d":"512,400"},{"v":170800,"d":"170,800"},0,0,null,null,{"v":198585,"d":"198,585"}]
[null,"N2277",2.7,2.205,{"v":4410000,"d":"4,410,000"},{"v":210000,"d":"210,000"},{"v":529200,"d":"529,200"},{"v":176400,"d":"176,400"},0,0,null,null,{"v":204831,"d":"204,831"}]
[null,"N2307",{"v":3,"d":"3.0"},{"v":2.31,"d":"2.310"},{"v":4620000,"d":"4,620,000"},{"v":210000,"d":"210,000"},{"v":554400,"d":"554,400"},{"v":184800,"d":"184,800"},0,0,null,null,{"v":214200,"d":"214,200"}]
[null,"N2327",3.2,{"v":2.39,"d":"2.390"},{"v":4780000,"d":"4,780,000"},{"v":210000,"d":"210,000"},{"v":573600,"d":"573,600"},{"v":191200,"d":"191,200"},0,0,null,null,{"v":221338,"d":"221,338"}]
[null,"N2357",3.5,{"v":2.51,"d":"2.510"},{"v":5020000,"d":"5,020,000"},{"v":210000,"d":"210,000"},{"v":602400,"d":"602,400"},{"v":200800,"d":"200,800"},0,0,null,null,{"v":232046,"d":"232,046"}]
[null,"N2377",3.7,{"v":2.59,"d":"2.590"},{"v":5180000,"d":"5,180,000"},{"v":210000,"d":"210,000"},{"v":621600,"d":"621,600"},{"v":207200,"d":"207,200"},0,0,null,null,{"v":239185,"d":"239,185"}]
[null,"N2407",{"v":4,"d":"4.0"},{"v":2.71,"d":"2.710"},{"v":5420000,"d":"5,420,000"},{"v":210000,"d":"210,000"},{"v":650400,"d":"650,400"},{"v":216800,"d":"216,800"},0,0,null,null,{"v":249892,"d":"249,892"}]
[null,"N2427",4.2,2.806,{"v":5612000,"d":"5,612,000"},{"v":210000,"d":"210,000"},{"v":673440,"d":"673,440"},{"v":224480,"d":"224,480"},0,0,null,null,{"v":258458,"d":"258,458"}]
[null,"N2457",4.5,{"v":2.95,"d":"2.950"},{"v":5900000,"d":"5,900,000"},{"v":210000,"d":"210,000"},{"v":708000,"d":"708,000"},{"v":236000,"d":"236,000"},0,0,null,null,{"v":271308,"d":"271,308"}]
[null,"N2477",4.7,3.046,{"v":6092000,"d":"6,092,000"},{"v":210000,"d":"210,000"},{"v":731040,"d":"731,040"},{"v":243680,"d":"243,680"},0,0,null,null,{"v":279874,"d":"279,874"}]
[null,"N2507",{"v":5,"d":"5.0"},{"v":3.19,"d":"3.190"},{"v":6380000,"d":"6,380,000"},{"v":210000,"d":"210,000"},{"v":765600,"d":"765,600"},{"v":255200,"d":"255,200"},0,0,null,null,{"v":292723,"d":"292,723"}]
[null,"N2527",5.2,{"v":3.3,"d":"3.300"},{"v":6600000,"d":"6,600,000"},{"v":210000,"d":"210,000"},{"v":792000,"d":"792,000"},{"v":264000,"d":"264,000"},0,0,null,null,{"v":302538,"d":"302,538"}]
[null,"N2557",5.5,3.465,{"v":6930000,"d":"6,930,000"},{"v":210000,"d":"210,000"},{"v":831600,"d":"831,600"},{"v":277200,"d":"277,200"},0,0,null,null,{"v":317262,"d":"317,262"}]
[null,"N2607",{"v":6,"d":"6.0"},{"v":3.74,"d":"3.740"},{"v":7480000,"d":"7,480,000"},{"v":210000,"d":"210,000"},{"v":897600,"d":"897,600"},{"v":299200,"d":"299,200"},0,0,null,null,{"v":341800,"d":"341,800"}]
[null,"N2707",{"v":7,"d":"7.0"},{"v":4.4,"d":"4.400"},{"v":8800000,"d":"8,800,000"},{"v":210000,"d":"210,000"},{"v":1056000,"d":"1,056,000"},{"v":352000,"d":"352,000"},0,0,null,null,{"v":400692,"d":"400,692"}]
["Nhóm III"]
[null,"N3207",{"v":2,"d":"2.0"},{"v":2.18,"d":"2.180"},{"$f":"D52*LTTV","v":{"v":4360000,"d":"4,360,000"}},{"v":210000,"d":"210,000"},{"$f":"E52*luongphu","v":{"v":523200,"d":"523,200"}},{"$f":"E52*khoantructiep","v":{"v":174400,"d":"174,400"}},{"$f":"E52*KhongOndinhSX","v":0},{"$f":"E52*thuhut","v":0},null,null,{"$f":"ROUND(SUM(E52:L52)/26,0)","v":{"v":202600,"d":"202,600"}}]
[null,"N3257",2.5,{"v":2.37,"d":"2.370"},{"v":4740000,"d":"4,740,000"},{"v":210000,"d":"210,000"},{"v":568800,"d":"568,800"},{"v":189600,"d":"189,600"},0,0,null,null,{"v":219554,"d":"219,554"}]
[null,"N3277",2.7,2.446,{"v":4892000,"d":"4,892,000"},{"v":210000,"d":"210,000"},{"v":587040,"d":"587,040"},{"v":195680,"d":"195,680"},0,0,null,null,{"v":226335,"d":"226,335"}]
[null,"N3307",{"v":3,"d":"3.0"},{"v":2.56,"d":"2.560"},{"v":5120000,"d":"5,120,000"},{"v":210000,"d":"210,000"},{"v":614400,"d":"614,400"},{"v":204800,"d":"204,800"},0,0,null,null,{"v":236508,"d":"236,508"}]
[null,"N3327",3.2,{"v":2.65,"d":"2.650"},{"v":5300000,"d":"5,300,000"},{"v":210000,"d":"210,000"},{"v":636000,"d":"636,000"},{"v":212000,"d":"212,000"},0,0,null,null,{"v":244538,"d":"244,538"}]
[null,"N3357",3.5,2.785,{"v":5570000,"d":"5,570,000"},{"v":210000,"d":"210,000"},{"v":668400,"d":"668,400"},{"v":222800,"d":"222,800"},0,0,null,null,{"v":256585,"d":"256,585"}]
[null,"N3377",3.7,2.875,{"v":5750000,"d":"5,750,000"},{"v":210000,"d":"210,000"},{"v":690000,"d":"690,000"},{"v":230000,"d":"230,000"},0,0,null,null,{"v":264615,"d":"264,615"}]
[null,"N3407",{"v":4,"d":"4.0"},{"v":3.01,"d":"3.010"},{"v":6020000,"d":"6,020,000"},{"v":210000,"d":"210,000"},{"v":722400,"d":"722,400"},{"v":240800,"d":"240,800"},0,0,null,null,{"v":276662,"d":"276,662"}]
[null,"N3427",4.2,{"v":3.1159999999999997,"d":"3.116"},{"v":6231999.999999999,"d":"6,232,000"},{"v":210000,"d":"210,000"},{"v":747839.9999999999,"d":"747,840"},{"v":249279.99999999997,"d":"249,280"},0,0,null,null,{"v":286120,"d":"286,120"}]
[null,"N3437",4.3,3.169,{"v":6338000,"d":"6,338,000"},{"v":210000,"d":"210,000"},{"v":760560,"d":"760,560"},{"v":253520,"d":"253,520"},0,0,null,null,{"v":290849,"d":"290,849"}]
[null,"N3457",4.5,3.275,{"v":6550000,"d":"6,550,000"},{"v":210000,"d":"210,000"},{"v":786000,"d":"786,000"},{"v":262000,"d":"262,000"},0,0,null,null,{"v":300308,"d":"300,308"}]
[null,"N3477",4.7,3.381,{"v":6762000,"d":"6,762,000"},{"v":210000,"d":"210,000"},{"v":811440,"d":"811,440"},{"v":270480,"d":"270,480"},0,0,null,null,{"v":309766,"d":"309,766"}]
[null,"N3507",{"v":5,"d":"5.0"},{"v":3.54,"d":"3.540"},{"v":7080000,"d":"7,080,000"},{"v":210000,"d":"210,000"},{"v":849600,"d":"849,600"},{"v":283200,"d":"283,200"},0,0,null,null,{"v":323954,"d":"323,954"}]
[null,"N3527",5.2,3.666,{"v":7332000,"d":"7,332,000"},{"v":210000,"d":"210,000"},{"v":879840,"d":"879,840"},{"v":293280,"d":"293,280"},0,0,null,null,{"v":335197,"d":"335,197"}]
[null,"N3557",5.5,3.855,{"v":7710000,"d":"7,710,000"},{"v":210000,"d":"210,000"},{"v":925200,"d":"925,200"},{"v":308400,"d":"308,400"},0,0,null,null,{"v":352062,"d":"352,062"}]
[null,"N3607",{"v":6,"d":"6.0"},{"v":4.17,"d":"4.170"},{"v":8340000,"d":"8,340,000"},{"v":210000,"d":"210,000"},{"v":1000800,"d":"1,000,800"},{"v":333600,"d":"333,600"},0,0,null,null,{"v":380169,"d":"380,169"}]
[null,"N3707",{"v":7,"d":"7.0"},{"v":4.9,"d":"4.900"},{"v":9800000,"d":"9,800,000"},{"v":210000,"d":"210,000"},{"v":1176000,"d":"1,176,000"},{"v":392000,"d":"392,000"},0,0,null,null,{"v":445308,"d":"445,308"}]
["A.1.5. BẢNG LƯƠNG CÔNG NHÂN CÔNG TRÌNH ĐÔ THỊ (THEO NGHỊ ĐỊNH 205/2004/NĐ-CP NGÀY 14/12/2004)"]
["Nhóm I"]
[null,"N1307dt",{"v":3,"d":"3.0"},{"v":2.16,"d":"2.160"},{"$f":"D71*LTTV","v":{"v":4320000,"d":"4,320,000"}},{"$f":"$F$10","v":{"v":210000,"d":"210,000"}},{"$f":"E71*luongphu","v":{"v":518400,"d":"518,400"}},{"$f":"E71*khoantructiep","v":{"v":172800,"d":"172,800"}},{"$f":"E71*KhongOndinhSX","v":0},{"$f":"E71*thuhut","v":0},null,null,{"$f":"ROUND(SUM(E71:L71)/26,0)","v":{"v":200815,"d":"200,815"}}]
[null,"N1357dt",3.5,2.355,{"v":4710000,"d":"4,710,000"},{"v":210000,"d":"210,000"},{"v":565200,"d":"565,200"},{"v":188400,"d":"188,400"},0,0,null,null,{"v":218215,"d":"218,215"}]
[null,"N1407dt",{"v":4,"d":"4.0"},{"v":2.55,"d":"2.550"},{"v":5100000,"d":"5,100,000"},{"v":210000,"d":"210,000"},{"v":612000,"d":"612,000"},{"v":204000,"d":"204,000"},0,0,null,null,{"v":235615,"d":"235,615"}]
[null,"N1457dt",4.5,{"v":2.78,"d":"2.780"},{"v":5560000,"d":"5,560,000"},{"v":210000,"d":"210,000"},{"v":667200,"d":"667,200"},{"v":222400,"d":"222,400"},0,0,null,null,{"v":256138,"d":"256,138"}]
[null,"N1507dt",{"v":5,"d":"5.0"},{"v":3.01,"d":"3.010"},{"v":6020000,"d":"6,020,000"},{"v":210000,"d":"210,000"},{"v":722400,"d":"722,400"},{"v":240800,"d":"240,800"},0,0,null,null,{"v":276662,"d":"276,662"}]
[null,"N1557dt",5.5,3.285,{"v":6570000,"d":"6,570,000"},{"v":210000,"d":"210,000"},{"v":788400,"d":"788,400"},{"v":262800,"d":"262,800"},0,0,null,null,{"v":301200,"d":"301,200"}]
[null,"N1607dt",{"v":6,"d":"6.0"},{"v":3.56,"d":"3.560"},{"v":7120000,"d":"7,120,000"},{"v":210000,"d":"210,000"},{"v":854400,"d":"854,400"},{"v":284800,"d":"284,800"},0,0,null,null,{"v":325738,"d":"325,738"}]
[null,"N1707dt",{"v":7,"d":"7.0"},{"v":4.2,"d":"4.200"},{"v":8400000,"d":"8,400,000"},{"v":210000,"d":"210,000"},{"v":1008000,"d":"1,008,000"},{"v":336000,"d":"336,000"},0,0,null,null,{"v":382846,"d":"382,846"}]
["Nhóm II"]
[null,"N2307dt",{"v":3,"d":"3.0"},{"v":2.31,"d":"2.310"},{"$f":"D80*LTTV","v":{"v":4620000,"d":"4,620,000"}},{"v":210000,"d":"210,000"},{"$f":"E80*luongphu","v":{"v":554400,"d":"554,400"}},{"$f":"E80*khoantructiep","v":{"v":184800,"d":"184,800"}},{"$f":"E80*KhongOndinhSX","v":0},{"$f":"E80*thuhut","v":0},null,null,{"$f":"ROUND(SUM(E80:L80)/26,0)","v":{"v":214200,"d":"214,200"}}]
[null,"N2357dt",3.5,{"v":2.51,"d":"2.510"},{"v":5020000,"d":"5,020,000"},{"v":210000,"d":"210,000"},{"v":602400,"d":"602,400"},{"v":200800,"d":"200,800"},0,0,null,null,{"v":232046,"d":"232,046"}]
[null,"N2407dt",{"v":4,"d":"4.0"},{"v":2.71,"d":"2.710"},{"v":5420000,"d":"5,420,000"},{"v":210000,"d":"210,000"},{"v":650400,"d":"650,400"},{"v":216800,"d":"216,800"},0,0,null,null,{"v":249892,"d":"249,892"}]
[null,"N2457dt",4.5,{"v":2.95,"d":"2.950"},{"v":5900000,"d":"5,900,000"},{"v":210000,"d":"210,000"},{"v":708000,"d":"708,000"},{"v":236000,"d":"236,000"},0,0,null,null,{"v":271308,"d":"271,308"}]
[null,"N2507dt",{"v":5,"d":"5.0"},{"v":3.19,"d":"3.190"},{"v":6380000,"d":"6,380,000"},{"v":210000,"d":"210,000"},{"v":765600,"d":"765,600"},{"v":255200,"d":"255,200"},0,0,null,null,{"v":292723,"d":"292,723"}]
[null,"N2557dt",5.5,3.465,{"v":6930000,"d":"6,930,000"},{"v":210000,"d":"210,000"},{"v":831600,"d":"831,600"},{"v":277200,"d":"277,200"},0,0,null,null,{"v":317262,"d":"317,262"}]
[null,"N2607dt",{"v":6,"d":"6.0"},{"v":3.74,"d":"3.740"},{"v":7480000,"d":"7,480,000"},{"v":210000,"d":"210,000"},{"v":897600,"d":"897,600"},{"v":299200,"d":"299,200"},0,0,null,null,{"v":341800,"d":"341,800"}]
[null,"N2707dt",{"v":7,"d":"7.0"},{"v":4.4,"d":"4.400"},{"v":8800000,"d":"8,800,000"},{"v":210000,"d":"210,000"},{"v":1056000,"d":"1,056,000"},{"v":352000,"d":"352,000"},0,0,null,null,{"v":400692,"d":"400,692"}]
["Nhóm III"]
[null,"N3307dt",{"v":3,"d":"3.0"},{"v":2.48,"d":"2.480"},{"$f":"D89*LTTV","v":{"v":4960000,"d":"4,960,000"}},{"$f":"$F$10","v":{"v":210000,"d":"210,000"}},{"$f":"E89*luongphu","v":{"v":595200,"d":"595,200"}},{"$f":"E89*khoantructiep","v":{"v":198400,"d":"198,400"}},{"$f":"E89*KhongOndinhSX","v":0},{"$f":"E89*thuhut","v":0},null,null,{"$f":"ROUND(SUM(E89:L89)/26,0)","v":{"v":229369,"d":"229,369"}}]
[null,"N3357dt",3.5,{"v":2.7,"d":"2.700"},{"v":5400000,"d":"5,400,000"},{"v":210000,"d":"210,000"},{"v":648000,"d":"648,000"},{"v":216000,"d":"216,000"},0,0,null,null,{"v":249000,"d":"249,000"}]
[null,"N3407dt",{"v":4,"d":"4.0"},{"v":2.92,"d":"2.920"},{"v":5840000,"d":"5,840,000"},{"v":210000,"d":"210,000"},{"v":700800,"d":"700,800"},{"v":233600,"d":"233,600"},0,0,null,null,{"v":268631,"d":"268,631"}]
[null,"N3457dt",4.5,3.185,{"v":6370000,"d":"6,370,000"},{"v":210000,"d":"210,000"},{"v":764400,"d":"764,400"},{"v":254800,"d":"254,800"},0,0,null,null,{"v":292277,"d":"292,277"}]
[null,"N3507dt",{"v":5,"d":"5.0"},{"v":3.45,"d":"3.450"},{"v":6900000,"d":"6,900,000"},{"v":210000,"d":"210,000"},{"v":828000,"d":"828,000"},{"v":276000,"d":"276,000"},0,0,null,null,{"v":315923,"d":"315,923"}]
[null,"N3557dt",5.5,{"v":3.7600000000000002,"d":"3.760"},{"v":7520000,"d":"7,520,000"},{"v":210000,"d":"210,000"},{"v":902400,"d":"902,400"},{"v":300800,"d":"300,800"},0,0,null,null,{"v":343585,"d":"343,585"}]
[null,"N3607dt",{"v":6,"d":"6.0"},{"v":4.07,"d":"4.070"},{"v":8140000.000000001,"d":"8,140,000"},{"v":210000,"d":"210,000"},{"v":976800.0000000001,"d":"976,800"},{"v":325600.00000000006,"d":"325,600"},0,0,null,null,{"v":371246,"d":"371,246"}]
[null,"N3707dt",{"v":7,"d":"7.0"},{"v":4.8,"d":"4.800"},{"v":9600000,"d":"9,600,000"},{"v":210000,"d":"210,000"},{"v":1152000,"d":"1,152,000"},{"v":384000,"d":"384,000"},0,0,null,null,{"v":436385,"d":"436,385"}]
["II. BẢNG LƯƠNG THỢ LẶN"]
["1. Thợ lặn"]
[null,null,"I",2.99,{"$f":"D99*LTTV","v":{"v":5980000,"d":"5,980,000"}},{"$f":"$F$10","v":{"v":210000,"d":"210,000"}},{"$f":"E99*luongphu","v":{"v":717600,"d":"717,600"}},{"$f":"E99*khoantructiep","v":{"v":239200,"d":"239,200"}},{"$f":"E99*KhongOndinhSX","v":0},{"$f":"E99*thuhut","v":0},null,null,{"$f":"ROUND(SUM(E99:L99)/26,0)","v":{"v":274877,"d":"274,877"}}]
[null,null,"II",3.28,{"$f":"D100*LTTV","v":{"v":6560000,"d":"6,560,000"}},{"$f":"$F$10","v":{"v":210000,"d":"210,000"}},{"$f":"E100*luongphu","v":{"v":787200,"d":"787,200"}},{"$f":"E100*khoantructiep","v":{"v":262400,"d":"262,400"}},{"$f":"E100*KhongOndinhSX","v":0},{"$f":"E100*thuhut","v":0},null,null,{"$f":"ROUND(SUM(E100:L100)/26,0)","v":{"v":300754,"d":"300,754"}}]
[null,null,"III",3.72,{"$f":"D101*LTTV","v":{"v":7440000,"d":"7,440,000"}},{"$f":"$F$10","v":{"v":210000,"d":"210,000"}},{"$f":"E101*luongphu","v":{"v":892800,"d":"892,800"}},{"$f":"E101*khoantructiep","v":{"v":297600,"d":"297,600"}},{"$f":"E101*KhongOndinhSX","v":0},{"$f":"E101*thuhut","v":0},null,null,{"$f":"ROUND(SUM(E101:L101)/26,0)","v":{"v":340015,"d":"340,015"}}]
[null,null,"IV",4.15,{"$f":"D102*LTTV","v":{"v":8300000.000000001,"d":"8,300,000"}},{"$f":"$F$10","v":{"v":210000,"d":"210,000"}},{"$f":"E102*luongphu","v":{"v":996000.0000000001,"d":"996,000"}},{"$f":"E102*khoantructiep","v":{"v":332000.00000000006,"d":"332,000"}},{"$f":"E102*KhongOndinhSX","v":0},{"$f":"E102*thuhut","v":0},null,null,{"$f":"ROUND(SUM(E102:L102)/26,0)","v":{"v":378385,"d":"378,385"}}]
["2. Thợ lặn cấp I"]
["",null,"I",4.67,{"$f":"D104*LTTV","v":{"v":9340000,"d":"9,340,000"}},{"$f":"$F$10","v":{"v":210000,"d":"210,000"}},{"$f":"E104*luongphu","v":{"v":1120800,"d":"1,120,800"}},{"$f":"E104*khoantructiep","v":{"v":373600,"d":"373,600"}},{"$f":"E104*KhongOndinhSX","v":0},{"$f":"E104*thuhut","v":0},null,null,{"$f":"ROUND(SUM(E104:L104)/26,0)","v":{"v":424785,"d":"424,785"}}]
[" ",null,"II",5.27,{"$f":"D105*LTTV","v":{"v":10540000,"d":"10,540,000"}},{"$f":"$F$10","v":{"v":210000,"d":"210,000"}},{"$f":"E105*luongphu","v":{"v":1264800,"d":"1,264,800"}},{"$f":"E105*khoantructiep","v":{"v":421600,"d":"421,600"}},{"$f":"E105*KhongOndinhSX","v":0},{"$f":"E105*thuhut","v":0},null,null,{"$f":"ROUND(SUM(E105:L105)/26,0)","v":{"v":478323,"d":"478,323"}}]
["3. Thợ lặn cấp III"]
["",null,"I",5.75,{"$f":"D107*LTTV","v":{"v":11500000,"d":"11,500,000"}},{"$f":"$F$10","v":{"v":210000,"d":"210,000"}},{"$f":"E107*luongphu","v":{"v":1380000,"d":"1,380,000"}},{"$f":"E107*khoantructiep","v":{"v":460000,"d":"460,000"}},{"$f":"E107*KhongOndinhSX","v":0},{"$f":"E107*thuhut","v":0},null,null,{"$f":"ROUND(SUM(E107:L107)/26,0)","v":{"v":521154,"d":"521,154"}}]
["B.12. BẢNG LƯƠNG CÔNG NHÂN LÁI XE"]
["1. Xe con, xe tắc xi, xe tải, xe cẩu dưới 3,5 tấn, xe khách dưới 20 ghế"]
[null,null,"I",2.18,{"$f":"D110*LTTV","v":{"v":4360000,"d":"4,360,000"}},{"$f":"$F$10","v":{"v":210000,"d":"210,000"}},{"$f":"E110*luongphu","v":{"v":523200,"d":"523,200"}},{"$f":"E110*khoantructiep","v":{"v":174400,"d":"174,400"}},{"$f":"E110*KhongOndinhSX","v":0},{"$f":"E110*thuhut","v":0},null,null,{"$f":"ROUND(SUM(E110:L110)/26,0)","v":{"v":202600,"d":"202,600"}}]
[null,null,"II",2.57,{"$f":"D111*LTTV","v":{"v":5140000,"d":"5,140,000"}},{"$f":"$F$10","v":{"v":210000,"d":"210,000"}},{"$f":"E111*luongphu","v":{"v":616800,"d":"616,800"}},{"$f":"E111*khoantructiep","v":{"v":205600,"d":"205,600"}},{"$f":"E111*KhongOndinhSX","v":0},{"$f":"E111*thuhut","v":0},null,null,{"$f":"ROUND(SUM(E111:L111)/26,0)","v":{"v":237400,"d":"237,400"}}]
[null,null,"III",3.05,{"$f":"D112*LTTV","v":{"v":6100000,"d":"6,100,000"}},{"$f":"$F$10","v":{"v":210000,"d":"210,000"}},{"$f":"E112*luongphu","v":{"v":732000,"d":"732,000"}},{"$f":"E112*khoantructiep","v":{"v":244000,"d":"244,000"}},{"$f":"E112*KhongOndinhSX","v":0},{"$f":"E112*thuhut","v":0},null,null,{"$f":"ROUND(SUM(E112:L112)/26,0)","v":{"v":280231,"d":"280,231"}}]
[null,null,"IV",{"v":3.6,"d":"3.60"},{"$f":"D113*LTTV","v":{"v":7200000,"d":"7,200,000"}},{"$f":"$F$10","v":{"v":210000,"d":"210,000"}},{"$f":"E113*luongphu","v":{"v":864000,"d":"864,000"}},{"$f":"E113*khoantructiep","v":{"v":288000,"d":"288,000"}},{"$f":"E113*KhongOndinhSX","v":0},{"$f":"E113*thuhut","v":0},null,null,{"$f":"ROUND(SUM(E113:L113)/26,0)","v":{"v":329308,"d":"329,308"}}]
["2. Xe tải, xe cẩu từ 3,5 tấn đến dưới 7,5 tấn, xe khách từ 20 ghế đến dưới 40 ghế"]
[null,null,"I",2.35,{"$f":"D115*LTTV","v":{"v":4700000,"d":"4,700,000"}},{"$f":"$F$10","v":{"v":210000,"d":"210,000"}},{"$f":"E115*luongphu","v":{"v":564000,"d":"564,000"}},{"$f":"E115*khoantructiep","v":{"v":188000,"d":"188,000"}},{"$f":"E115*KhongOndinhSX","v":0},{"$f":"E115*thuhut","v":0},null,null,{"$f":"ROUND(SUM(E115:L115)/26,0)","v":{"v":217769,"d":"217,769"}}]
[null,null,"II",2.76,{"$f":"D116*LTTV","v":{"v":5520000,"d":"5,520,000"}},{"$f":"$F$10","v":{"v":210000,"d":"210,000"}},{"$f":"E116*luongphu","v":{"v":662400,"d":"662,400"}},{"$f":"E116*khoantructiep","v":{"v":220800,"d":"220,800"}},{"$f":"E116*KhongOndinhSX","v":0},{"$f":"E116*thuhut","v":0},null,null,{"$f":"ROUND(SUM(E116:L116)/26,0)","v":{"v":254354,"d":"254,354"}}]
[null,null,"III",3.25,{"$f":"D117*LTTV","v":{"v":6500000,"d":"6,500,000"}},{"$f":"$F$10","v":{"v":210000,"d":"210,000"}},{"$f":"E117*luongphu","v":{"v":780000,"d":"780,000"}},{"$f":"E117*khoantructiep","v":{"v":260000,"d":"260,000"}},{"$f":"E117*KhongOndinhSX","v":0},{"$f":"E117*thuhut","v":0},null,null,{"$f":"ROUND(SUM(E117:L117)/26,0)","v":{"v":298077,"d":"298,077"}}]
[null,null,"IV",3.82,{"$f":"D118*LTTV","v":{"v":7640000,"d":"7,640,000"}},{"$f":"$F$10","v":{"v":210000,"d":"210,000"}},{"$f":"E118*luongphu","v":{"v":916800,"d":"916,800"}},{"$f":"E118*khoantructiep","v":{"v":305600,"d":"305,600"}},{"$f":"E118*KhongOndinhSX","v":0},{"$f":"E118*thuhut","v":0},null,null,{"$f":"ROUND(SUM(E118:L118)/26,0)","v":{"v":348938,"d":"348,938"}}]
["3. Xe tải, xe cẩu từ 7,5 tấn đến dưới 16,5 tấn, xe khách từ 40 ghế đến dưới 60 ghế"]
[null,null,"I",2.51,{"$f":"D120*LTTV","v":{"v":5020000,"d":"5,020,000"}},{"$f":"$F$10","v":{"v":210000,"d":"210,000"}},{"$f":"E120*luongphu","v":{"v":602400,"d":"602,400"}},{"$f":"E120*khoantructiep","v":{"v":200800,"d":"200,800"}},{"$f":"E120*KhongOndinhSX","v":0},{"$f":"E120*thuhut","v":0},null,null,{"$f":"ROUND(SUM(E120:L120)/26,0)","v":{"v":232046,"d":"232,046"}}]
[null,null,"II",2.94,{"$f":"D121*LTTV","v":{"v":5880000,"d":"5,880,000"}},{"$f":"$F$10","v":{"v":210000,"d":"210,000"}},{"$f":"E121*luongphu","v":{"v":705600,"d":"705,600"}},{"$f":"E121*khoantructiep","v":{"v":235200,"d":"235,200"}},{"$f":"E121*KhongOndinhSX","v":0},{"$f":"E121*thuhut","v":0},null,null,{"$f":"ROUND(SUM(E121:L121)/26,0)","v":{"v":270415,"d":"270,415"}}]
[null,null,"III",3.44,{"$f":"D122*LTTV","v":{"v":6880000,"d":"6,880,000"}},{"$f":"$F$10","v":{"v":210000,"d":"210,000"}},{"$f":"E122*luongphu","v":{"v":825600,"d":"825,600"}},{"$f":"E122*khoantructiep","v":{"v":275200,"d":"275,200"}},{"$f":"E122*KhongOndinhSX","v":0},{"$f":"E122*thuhut","v":0},null,null,{"$f":"ROUND(SUM(E122:L122)/26,0)","v":{"v":315031,"d":"315,031"}}]
[null,null,"IV",4.05,{"$f":"D123*LTTV","v":{"v":8100000,"d":"8,100,000"}},{"$f":"$F$10","v":{"v":210000,"d":"210,000"}},{"$f":"E123*luongphu","v":{"v":972000,"d":"972,000"}},{"$f":"E123*khoantructiep","v":{"v":324000,"d":"324,000"}},{"$f":"E123*KhongOndinhSX","v":0},{"$f":"E123*thuhut","v":0},null,null,{"$f":"ROUND(SUM(E123:L123)/26,0)","v":{"v":369462,"d":"369,462"}}]
["4. Xe tải, xe cẩu từ 16,5 tấn đến dưới 25 tấn, xe khách từ 60 ghế đến dưới 80 ghế"]
[null,null,"I",2.66,{"$f":"D125*LTTV","v":{"v":5320000,"d":"5,320,000"}},{"$f":"$F$10","v":{"v":210000,"d":"210,000"}},{"$f":"E125*luongphu","v":{"v":638400,"d":"638,400"}},{"$f":"E125*khoantructiep","v":{"v":212800,"d":"212,800"}},{"$f":"E125*KhongOndinhSX","v":0},{"$f":"E125*thuhut","v":0},null,null,{"$f":"ROUND(SUM(E125:L125)/26,0)","v":{"v":245431,"d":"245,431"}}]
[null,null,"II",3.11,{"$f":"D126*LTTV","v":{"v":6220000,"d":"6,220,000"}},{"$f":"$F$10","v":{"v":210000,"d":"210,000"}},{"$f":"E126*luongphu","v":{"v":746400,"d":"746,400"}},{"$f":"E126*khoantructiep","v":{"v":248800,"d":"248,800"}},{"$f":"E126*KhongOndinhSX","v":0},{"$f":"E126*thuhut","v":0},null,null,{"$f":"ROUND(SUM(E126:L126)/26,0)","v":{"v":285585,"d":"285,585"}}]
[null,null,"III",3.64,{"$f":"D127*LTTV","v":{"v":7280000,"d":"7,280,000"}},{"$f":"$F$10","v":{"v":210000,"d":"210,000"}},{"$f":"E127*luongphu","v":{"v":873600,"d":"873,600"}},{"$f":"E127*khoantructiep","v":{"v":291200,"d":"291,200"}},{"$f":"E127*KhongOndinhSX","v":0},{"$f":"E127*thuhut","v":0},null,null,{"$f":"ROUND(SUM(E127:L127)/26,0)","v":{"v":332877,"d":"332,877"}}]
[null,null,"IV",{"v":4.2,"d":"4.20"},{"$f":"D128*LTTV","v":{"v":8400000,"d":"8,400,000"}},{"$f":"$F$10","v":{"v":210000,"d":"210,000"}},{"$f":"E128*luongphu","v":{"v":1008000,"d":"1,008,000"}},{"$f":"E128*khoantructiep","v":{"v":336000,"d":"336,000"}},{"$f":"E128*KhongOndinhSX","v":0},{"$f":"E128*thuhut","v":0},null,null,{"$f":"ROUND(SUM(E128:L128)/26,0)","v":{"v":382846,"d":"382,846"}}]
["5. Xe tải, xe cẩu từ 25 tấn đến dưới 40 tấn, xe khách từ 80 ghế trở lên"]
[null,null,"I",2.99,{"$f":"D130*LTTV","v":{"v":5980000,"d":"5,980,000"}},{"$f":"$F$10","v":{"v":210000,"d":"210,000"}},{"$f":"E130*luongphu","v":{"v":717600,"d":"717,600"}},{"$f":"E130*khoantructiep","v":{"v":239200,"d":"239,200"}},{"$f":"E130*KhongOndinhSX","v":0},{"$f":"E130*thuhut","v":0},null,null,{"$f":"ROUND(SUM(E130:L130)/26,0)","v":{"v":274877,"d":"274,877"}}]
[null,null,"II",{"v":3.5,"d":"3.50"},{"$f":"D131*LTTV","v":{"v":7000000,"d":"7,000,000"}},{"$f":"$F$10","v":{"v":210000,"d":"210,000"}},{"$f":"E131*luongphu","v":{"v":840000,"d":"840,000"}},{"$f":"E131*khoantructiep","v":{"v":280000,"d":"280,000"}},{"$f":"E131*KhongOndinhSX","v":0},{"$f":"E131*thuhut","v":0},null,null,{"$f":"ROUND(SUM(E131:L131)/26,0)","v":{"v":320385,"d":"320,385"}}]
[null,null,"III",4.11,{"$f":"D132*LTTV","v":{"v":8220000.000000001,"d":"8,220,000"}},{"$f":"$F$10","v":{"v":210000,"d":"210,000"}},{"$f":"E132*luongphu","v":{"v":986400.0000000001,"d":"986,400"}},{"$f":"E132*khoantructiep","v":{"v":328800.00000000006,"d":"328,800"}},{"$f":"E132*KhongOndinhSX","v":0},{"$f":"E132*thuhut","v":0},null,null,{"$f":"ROUND(SUM(E132:L132)/26,0)","v":{"v":374815,"d":"374,815"}}]
[null,null,"IV",4.82,{"$f":"D133*LTTV","v":{"v":9640000,"d":"9,640,000"}},{"$f":"$F$10","v":{"v":210000,"d":"210,000"}},{"$f":"E133*luongphu","v":{"v":1156800,"d":"1,156,800"}},{"$f":"E133*khoantructiep","v":{"v":385600,"d":"385,600"}},{"$f":"E133*KhongOndinhSX","v":0},{"$f":"E133*thuhut","v":0},null,null,{"$f":"ROUND(SUM(E133:L133)/26,0)","v":{"v":438169,"d":"438,169"}}]
["6. Xe tải, xe cẩu từ 40 tấn trở lên"]
[null,null,"I",{"v":3.2,"d":"3.20"},{"$f":"D135*LTTV","v":{"v":6400000,"d":"6,400,000"}},{"$f":"$F$10","v":{"v":210000,"d":"210,000"}},{"$f":"E135*luongphu","v":{"v":768000,"d":"768,000"}},{"$f":"E135*khoantructiep","v":{"v":256000,"d":"256,000"}},{"$f":"E135*KhongOndinhSX","v":0},{"$f":"E135*thuhut","v":0},null,null,{"$f":"ROUND(SUM(E135:L135)/26,0)","v":{"v":293615,"d":"293,615"}}]
[null,null,"II",3.75,{"$f":"D136*LTTV","v":{"v":7500000,"d":"7,500,000"}},{"$f":"$F$10","v":{"v":210000,"d":"210,000"}},{"$f":"E136*luongphu","v":{"v":900000,"d":"900,000"}},{"$f":"E136*khoantructiep","v":{"v":300000,"d":"300,000"}},{"$f":"E136*KhongOndinhSX","v":0},{"$f":"E136*thuhut","v":0},null,null,{"$f":"ROUND(SUM(E136:L136)/26,0)","v":{"v":342692,"d":"342,692"}}]
[null,null,"III",4.39,{"$f":"D137*LTTV","v":{"v":8780000,"d":"8,780,000"}},{"$f":"$F$10","v":{"v":210000,"d":"210,000"}},{"$f":"E137*luongphu","v":{"v":1053600,"d":"1,053,600"}},{"$f":"E137*khoantructiep","v":{"v":351200,"d":"351,200"}},{"$f":"E137*KhongOndinhSX","v":0},{"$f":"E137*thuhut","v":0},null,null,{"$f":"ROUND(SUM(E137:L137)/26,0)","v":{"v":399800,"d":"399,800"}}]
[null,null,"IV",5.15,{"$f":"D138*LTTV","v":{"v":10300000,"d":"10,300,000"}},{"$f":"$F$10","v":{"v":210000,"d":"210,000"}},{"$f":"E138*luongphu","v":{"v":1236000,"d":"1,236,000"}},{"$f":"E138*khoantructiep","v":{"v":412000,"d":"412,000"}},{"$f":"E138*KhongOndinhSX","v":0},{"$f":"E138*thuhut","v":0},null,null,{"$f":"ROUND(SUM(E138:L138)/26,0)","v":{"v":467615,"d":"467,615"}}]
["B.2. BẢNG LƯƠNG THUYỀN VIÊN VÀ CÔNG NHÂN VIÊN TÀU VẬN TẢI BIỂN, VẬN TẢI SÔNG, TÀU DỊCH VỤ DẦU KHÍ, TÀU CẨU DẦU KHÍ"]
["B.2.I. TÀU VẬN TẢI BIỂN, VẬN TẢI SÔNG"]
["B.2.I.1. Tàu vận tải biển, vận tải sông không theo nhóm tàu "]
["CHỨC DANH KHÔNG THEO NHÓM TÀU"]
["I/ Tàu vận tải biển"]
["1. Thuỷ thủ"]
[{"$nulls":3},2.18,{"$f":"D145*LTTV","v":{"v":4360000,"d":"4,360,000"}},{"$f":"$F$10","v":{"v":210000,"d":"210,000"}},{"$f":"E145*luongphu","v":{"v":523200,"d":"523,200"}},{"$f":"E145*khoantructiep","v":{"v":174400,"d":"174,400"}},{"$f":"E145*KhongOndinhSX","v":0},{"$f":"E145*thuhut","v":0},null,null,{"$f":"ROUND(SUM(E145:L145)/26,0)","v":{"v":202600,"d":"202,600"}}]
[{"$nulls":3},2.59,{"$f":"D146*LTTV","v":{"v":5180000,"d":"5,180,000"}},{"$f":"$F$10","v":{"v":210000,"d":"210,000"}},{"$f":"E146*luongphu","v":{"v":621600,"d":"621,600"}},{"$f":"E146*khoantructiep","v":{"v":207200,"d":"207,200"}},{"$f":"E146*KhongOndinhSX","v":0},{"$f":"E146*thuhut","v":0},null,null,{"$f":"ROUND(SUM(E146:L146)/26,0)","v":{"v":239185,"d":"239,185"}}]
[{"$nulls":3},3.08,{"$f":"D147*LTTV","v":{"v":6160000,"d":"6,160,000"}},{"$f":"$F$10","v":{"v":210000,"d":"210,000"}},{"$f":"E147*luongphu","v":{"v":739200,"d":"739,200"}},{"$f":"E147*khoantructiep","v":{"v":246400,"d":"246,400"}},{"$f":"E147*KhongOndinhSX","v":0},{"$f":"E147*thuhut","v":0},null,null,{"$f":"ROUND(SUM(E147:L147)/26,0)","v":{"v":282908,"d":"282,908"}}]
[{"$nulls":3},3.73,{"$f":"D148*LTTV","v":{"v":7460000,"d":"7,460,000"}},{"$f":"$F$10","v":{"v":210000,"d":"210,000"}},{"$f":"E148*luongphu","v":{"v":895200,"d":"895,200"}},{"$f":"E148*khoantructiep","v":{"v":298400,"d":"298,400"}},{"$f":"E148*KhongOndinhSX","v":0},{"$f":"E148*thuhut","v":0},null,null,{"$f":"ROUND(SUM(E148:L148)/26,0)","v":{"v":340908,"d":"340,908"}}]
["2. Thợ máy kiêm cơ khí, thợ bơm"]
[{"$nulls":3},2.51,{"$f":"D150*LTTV","v":{"v":5020000,"d":"5,020,000"}},{"$f":"$F$10","v":{"v":210000,"d":"210,000"}},{"$f":"E150*luongphu","v":{"v":602400,"d":"602,400"}},{"$f":"E150*khoantructiep","v":{"v":200800,"d":"200,800"}},{"$f":"E150*KhongOndinhSX","v":0},{"$f":"E150*thuhut","v":0},null,null,{"$f":"ROUND(SUM(E150:L150)/26,0)","v":{"v":232046,"d":"232,046"}}]
[{"$nulls":3},2.93,{"$f":"D151*LTTV","v":{"v":5860000,"d":"5,860,000"}},{"$f":"$F$10","v":{"v":210000,"d":"210,000"}},{"$f":"E151*luongphu","v":{"v":703200,"d":"703,200"}},{"$f":"E151*khoantructiep","v":{"v":234400,"d":"234,400"}},{"$f":"E151*KhongOndinhSX","v":0},{"$f":"E151*thuhut","v":0},null,null,{"$f":"ROUND(SUM(E151:L151)/26,0)","v":{"v":269523,"d":"269,523"}}]
[{"$nulls":3},3.49,{"$f":"D152*LTTV","v":{"v":6980000,"d":"6,980,000"}},{"$f":"$F$10","v":{"v":210000,"d":"210,000"}},{"$f":"E152*luongphu","v":{"v":837600,"d":"837,600"}},{"$f":"E152*khoantructiep","v":{"v":279200,"d":"279,200"}},{"$f":"E152*KhongOndinhSX","v":0},{"$f":"E152*thuhut","v":0},null,null,{"$f":"ROUND(SUM(E152:L152)/26,0)","v":{"v":319492,"d":"319,492"}}]
[{"$nulls":3},4.16,{"$f":"D153*LTTV","v":{"v":8320000,"d":"8,320,000"}},{"$f":"$F$10","v":{"v":210000,"d":"210,000"}},{"$f":"E153*luongphu","v":{"v":998400,"d":"998,400"}},{"$f":"E153*khoantructiep","v":{"v":332800,"d":"332,800"}},{"$f":"E153*KhongOndinhSX","v":0},{"$f":"E153*thuhut","v":0},null,null,{"$f":"ROUND(SUM(E153:L153)/26,0)","v":{"v":379277,"d":"379,277"}}]
["3. Thợ máy, điện, vô tuyến điện"]
[{"$nulls":3},2.35,{"$f":"D155*LTTV","v":{"v":4700000,"d":"4,700,000"}},{"$f":"$F$10","v":{"v":210000,"d":"210,000"}},{"$f":"E155*luongphu","v":{"v":564000,"d":"564,000"}},{"$f":"E155*khoantructiep","v":{"v":188000,"d":"188,000"}},{"$f":"E155*KhongOndinhSX","v":0},{"$f":"E155*thuhut","v":0},null,null,{"$f":"ROUND(SUM(E155:L155)/26,0)","v":{"v":217769,"d":"217,769"}}]
[{"$nulls":3},2.72,{"$f":"D156*LTTV","v":{"v":5440000,"d":"5,440,000"}},{"$f":"$F$10","v":{"v":210000,"d":"210,000"}},{"$f":"E156*luongphu","v":{"v":652800,"d":"652,800"}},{"$f":"E156*khoantructiep","v":{"v":217600,"d":"217,600"}},{"$f":"E156*KhongOndinhSX","v":0},{"$f":"E156*thuhut","v":0},null,null,{"$f":"ROUND(SUM(E156:L156)/26,0)","v":{"v":250785,"d":"250,785"}}]
[{"$nulls":3},3.25,{"$f":"D157*LTTV","v":{"v":6500000,"d":"6,500,000"}},{"$f":"$F$10","v":{"v":210000,"d":"210,000"}},{"$f":"E157*luongphu","v":{"v":780000,"d":"780,000"}},{"$f":"E157*khoantructiep","v":{"v":260000,"d":"260,000"}},{"$f":"E157*KhongOndinhSX","v":0},{"$f":"E157*thuhut","v":0},null,null,{"$f":"ROUND(SUM(E157:L157)/26,0)","v":{"v":298077,"d":"298,077"}}]
[{"$nulls":3},3.91,{"$f":"D158*LTTV","v":{"v":7820000,"d":"7,820,000"}},{"$f":"$F$10","v":{"v":210000,"d":"210,000"}},{"$f":"E158*luongphu","v":{"v":938400,"d":"938,400"}},{"$f":"E158*khoantructiep","v":{"v":312800,"d":"312,800"}},{"$f":"E158*KhongOndinhSX","v":0},{"$f":"E158*thuhut","v":0},null,null,{"$f":"ROUND(SUM(E158:L158)/26,0)","v":{"v":356969,"d":"356,969"}}]
["4. Phục vụ viên"]
[{"$nulls":3},1.75,{"$f":"D160*LTTV","v":{"v":3500000,"d":"3,500,000"}},{"$f":"$F$10","v":{"v":210000,"d":"210,000"}},{"$f":"E160*luongphu","v":{"v":420000,"d":"420,000"}},{"$f":"E160*khoantructiep","v":{"v":140000,"d":"140,000"}},{"$f":"E160*KhongOndinhSX","v":0},{"$f":"E160*thuhut","v":0},null,null,{"$f":"ROUND(SUM(E160:L160)/26,0)","v":{"v":164231,"d":"164,231"}}]
[{"$nulls":3},1.99,{"$f":"D161*LTTV","v":{"v":3980000,"d":"3,980,000"}},{"$f":"$F$10","v":{"v":210000,"d":"210,000"}},{"$f":"E161*luongphu","v":{"v":477600,"d":"477,600"}},{"$f":"E161*khoantructiep","v":{"v":159200,"d":"159,200"}},{"$f":"E161*KhongOndinhSX","v":0},{"$f":"E161*thuhut","v":0},null,null,{"$f":"ROUND(SUM(E161:L161)/26,0)","v":{"v":185646,"d":"185,646"}}]
[{"$nulls":3},2.35,{"$f":"D162*LTTV","v":{"v":4700000,"d":"4,700,000"}},{"$f":"$F$10","v":{"v":210000,"d":"210,000"}},{"$f":"E162*luongphu","v":{"v":564000,"d":"564,000"}},{"$f":"E162*khoantructiep","v":{"v":188000,"d":"188,000"}},{"$f":"E162*KhongOndinhSX","v":0},{"$f":"E162*thuhut","v":0},null,null,{"$f":"ROUND(SUM(E162:L162)/26,0)","v":{"v":217769,"d":"217,769"}}]
[{"$nulls":3},2.66,{"$f":"D163*LTTV","v":{"v":5320000,"d":"5,320,000"}},{"$f":"$F$10","v":{"v":210000,"d":"210,000"}},{"$f":"E163*luongphu","v":{"v":638400,"d":"638,400"}},{"$f":"E163*khoantructiep","v":{"v":212800,"d":"212,800"}},{"$f":"E163*KhongOndinhSX","v":0},{"$f":"E163*thuhut","v":0},null,null,{"$f":"ROUND(SUM(E163:L163)/26,0)","v":{"v":245431,"d":"245,431"}}]
["5. Cấp dưỡng"]
[{"$nulls":3},1.93,{"$f":"D165*LTTV","v":{"v":3860000,"d":"3,860,000"}},{"$f":"$F$10","v":{"v":210000,"d":"210,000"}},{"$f":"E165*luongphu","v":{"v":463200,"d":"463,200"}},{"$f":"E165*khoantructiep","v":{"v":154400,"d":"154,400"}},{"$f":"E165*KhongOndinhSX","v":0},{"$f":"E165*thuhut","v":0},null,null,{"$f":"ROUND(SUM(E165:L165)/26,0)","v":{"v":180292,"d":"180,292"}}]
[{"$nulls":3},2.38,{"$f":"D166*LTTV","v":{"v":4760000,"d":"4,760,000"}},{"$f":"$F$10","v":{"v":210000,"d":"210,000"}},{"$f":"E166*luongphu","v":{"v":571200,"d":"571,200"}},{"$f":"E166*khoantructiep","v":{"v":190400,"d":"190,400"}},{"$f":"E166*KhongOndinhSX","v":0},{"$f":"E166*thuhut","v":0},null,null,{"$f":"ROUND(SUM(E166:L166)/26,0)","v":{"v":220446,"d":"220,446"}}]
[{"$nulls":3},2.74,{"$f":"D167*LTTV","v":{"v":5480000,"d":"5,480,000"}},{"$f":"$F$10","v":{"v":210000,"d":"210,000"}},{"$f":"E167*luongphu","v":{"v":657600,"d":"657,600"}},{"$f":"E167*khoantructiep","v":{"v":219200,"d":"219,200"}},{"$f":"E167*KhongOndinhSX","v":0},{"$f":"E167*thuhut","v":0},null,null,{"$f":"ROUND(SUM(E167:L167)/26,0)","v":{"v":252569,"d":"252,569"}}]
[{"$nulls":3},3.15,{"$f":"D168*LTTV","v":{"v":6300000,"d":"6,300,000"}},{"$f":"$F$10","v":{"v":210000,"d":"210,000"}},{"$f":"E168*luongphu","v":{"v":756000,"d":"756,000"}},{"$f":"E168*khoantructiep","v":{"v":252000,"d":"252,000"}},{"$f":"E168*KhongOndinhSX","v":0},{"$f":"E168*thuhut","v":0},null,null,{"$f":"ROUND(SUM(E168:L168)/26,0)","v":{"v":289154,"d":"289,154"}}]
["II/ Tàu vận tải sông và sang ngang"]
["1. Thuỷ thủ"]
["Nhóm I (vận tải dọc sông)"]
[{"$nulls":3},1.93,{"$f":"D172*LTTV","v":{"v":3860000,"d":"3,860,000"}},{"$f":"$F$10","v":{"v":210000,"d":"210,000"}},{"$f":"E172*luongphu","v":{"v":463200,"d":"463,200"}},{"$f":"E172*khoantructiep","v":{"v":154400,"d":"154,400"}},{"$f":"E172*KhongOndinhSX","v":0},{"$f":"E172*thuhut","v":0},null,null,{"$f":"ROUND(SUM(E172:L172)/26,0)","v":{"v":180292,"d":"180,292"}}]
[{"$nulls":3},2.18,{"$f":"D173*LTTV","v":{"v":4360000,"d":"4,360,000"}},{"$f":"$F$10","v":{"v":210000,"d":"210,000"}},{"$f":"E173*luongphu","v":{"v":523200,"d":"523,200"}},{"$f":"E173*khoantructiep","v":{"v":174400,"d":"174,400"}},{"$f":"E173*KhongOndinhSX","v":0},{"$f":"E173*thuhut","v":0},null,null,{"$f":"ROUND(SUM(E173:L173)/26,0)","v":{"v":202600,"d":"202,600"}}]
[{"$nulls":3},2.51,{"$f":"D174*LTTV","v":{"v":5020000,"d":"5,020,000"}},{"$f":"$F$10","v":{"v":210000,"d":"210,000"}},{"$f":"E174*luongphu","v":{"v":602400,"d":"602,400"}},{"$f":"E174*khoantructiep","v":{"v":200800,"d":"200,800"}},{"$f":"E174*KhongOndinhSX","v":0},{"$f":"E174*thuhut","v":0},null,null,{"$f":"ROUND(SUM(E174:L174)/26,0)","v":{"v":232046,"d":"232,046"}}]
[{"$nulls":3},2.83,{"$f":"D175*LTTV","v":{"v":5660000,"d":"5,660,000"}},{"$f":"$F$10","v":{"v":210000,"d":"210,000"}},{"$f":"E175*luongphu","v":{"v":679200,"d":"679,200"}},{"$f":"E175*khoantructiep","v":{"v":226400,"d":"226,400"}},{"$f":"E175*KhongOndinhSX","v":0},{"$f":"E175*thuhut","v":0},null,null,{"$f":"ROUND(SUM(E175:L175)/26,0)","v":{"v":260600,"d":"260,600"}}]
["Nhóm II (vận tải sang ngang)"]
[{"$nulls":3},2.12,{"$f":"D177*LTTV","v":{"v":4240000,"d":"4,240,000"}},{"$f":"$F$10","v":{"v":210000,"d":"210,000"}},{"$f":"E177*luongphu","v":{"v":508800,"d":"508,800"}},{"$f":"E177*khoantructiep","v":{"v":169600,"d":"169,600"}},{"$f":"E177*KhongOndinhSX","v":0},{"$f":"E177*thuhut","v":0},null,null,{"$f":"ROUND(SUM(E177:L177)/26,0)","v":{"v":197246,"d":"197,246"}}]
[{"$nulls":3},2.39,{"$f":"D178*LTTV","v":{"v":4780000,"d":"4,780,000"}},{"$f":"$F$10","v":{"v":210000,"d":"210,000"}},{"$f":"E178*luongphu","v":{"v":573600,"d":"573,600"}},{"$f":"E178*khoantructiep","v":{"v":191200,"d":"191,200"}},{"$f":"E178*KhongOndinhSX","v":0},{"$f":"E178*thuhut","v":0},null,null,{"$f":"ROUND(SUM(E178:L178)/26,0)","v":{"v":221338,"d":"221,338"}}]
[{"$nulls":3},2.76,{"$f":"D179*LTTV","v":{"v":5520000,"d":"5,520,000"}},{"$f":"$F$10","v":{"v":210000,"d":"210,000"}},{"$f":"E179*luongphu","v":{"v":662400,"d":"662,400"}},{"$f":"E179*khoantructiep","v":{"v":220800,"d":"220,800"}},{"$f":"E179*KhongOndinhSX","v":0},{"$f":"E179*thuhut","v":0},null,null,{"$f":"ROUND(SUM(E179:L179)/26,0)","v":{"v":254354,"d":"254,354"}}]
[{"$nulls":3},3.11,{"$f":"D180*LTTV","v":{"v":6220000,"d":"6,220,000"}},{"$f":"$F$10","v":{"v":210000,"d":"210,000"}},{"$f":"E180*luongphu","v":{"v":746400,"d":"746,400"}},{"$f":"E180*khoantructiep","v":{"v":248800,"d":"248,800"}},{"$f":"E180*KhongOndinhSX","v":0},{"$f":"E180*thuhut","v":0},null,null,{"$f":"ROUND(SUM(E180:L180)/26,0)","v":{"v":285585,"d":"285,585"}}]
["2. Thợ máy, thợ điện"]
["Nhóm I (vận tải dọc sông)"]
[{"$nulls":3},2.05,{"$f":"D183*LTTV","v":{"v":4099999.9999999995,"d":"4,100,000"}},{"$f":"$F$10","v":{"v":210000,"d":"210,000"}},{"$f":"E183*luongphu","v":{"v":491999.99999999994,"d":"492,000"}},{"$f":"E183*khoantructiep","v":{"v":163999.99999999997,"d":"164,000"}},{"$f":"E183*KhongOndinhSX","v":0},{"$f":"E183*thuhut","v":0},null,null,{"$f":"ROUND(SUM(E183:L183)/26,0)","v":{"v":191000,"d":"191,000"}}]
[{"$nulls":3},2.35,{"$f":"D184*LTTV","v":{"v":4700000,"d":"4,700,000"}},{"$f":"$F$10","v":{"v":210000,"d":"210,000"}},{"$f":"E184*luongphu","v":{"v":564000,"d":"564,000"}},{"$f":"E184*khoantructiep","v":{"v":188000,"d":"188,000"}},{"$f":"E184*KhongOndinhSX","v":0},{"$f":"E184*thuhut","v":0},null,null,{"$f":"ROUND(SUM(E184:L184)/26,0)","v":{"v":217769,"d":"217,769"}}]
[{"$nulls":3},2.66,{"$f":"D185*LTTV","v":{"v":5320000,"d":"5,320,000"}},{"$f":"$F$10","v":{"v":210000,"d":"210,000"}},{"$f":"E185*luongphu","v":{"v":638400,"d":"638,400"}},{"$f":"E185*khoantructiep","v":{"v":212800,"d":"212,800"}},{"$f":"E185*KhongOndinhSX","v":0},{"$f":"E185*thuhut","v":0},null,null,{"$f":"ROUND(SUM(E185:L185)/26,0)","v":{"v":245431,"d":"245,431"}}]
[{"$nulls":3},2.99,{"$f":"D186*LTTV","v":{"v":5980000,"d":"5,980,000"}},{"$f":"$F$10","v":{"v":210000,"d":"210,000"}},{"$f":"E186*luongphu","v":{"v":717600,"d":"717,600"}},{"$f":"E186*khoantructiep","v":{"v":239200,"d":"239,200"}},{"$f":"E186*KhongOndinhSX","v":0},{"$f":"E186*thuhut","v":0},null,null,{"$f":"ROUND(SUM(E186:L186)/26,0)","v":{"v":274877,"d":"274,877"}}]
["Nhóm II (vận tải sang ngang)"]
[{"$nulls":3},2.25,{"$f":"D188*LTTV","v":{"v":4500000,"d":"4,500,000"}},{"$f":"$F$10","v":{"v":210000,"d":"210,000"}},{"$f":"E188*luongphu","v":{"v":540000,"d":"540,000"}},{"$f":"E188*khoantructiep","v":{"v":180000,"d":"180,000"}},{"$f":"E188*KhongOndinhSX","v":0},{"$f":"E188*thuhut","v":0},null,null,{"$f":"ROUND(SUM(E188:L188)/26,0)","v":{"v":208846,"d":"208,846"}}]
[{"$nulls":3},2.58,{"$f":"D189*LTTV","v":{"v":5160000,"d":"5,160,000"}},{"$f":"$F$10","v":{"v":210000,"d":"210,000"}},{"$f":"E189*luongphu","v":{"v":619200,"d":"619,200"}},{"$f":"E189*khoantructiep","v":{"v":206400,"d":"206,400"}},{"$f":"E189*KhongOndinhSX","v":0},{"$f":"E189*thuhut","v":0},null,null,{"$f":"ROUND(SUM(E189:L189)/26,0)","v":{"v":238292,"d":"238,292"}}]
[{"$nulls":3},2.92,{"$f":"D190*LTTV","v":{"v":5840000,"d":"5,840,000"}},{"$f":"$F$10","v":{"v":210000,"d":"210,000"}},{"$f":"E190*luongphu","v":{"v":700800,"d":"700,800"}},{"$f":"E190*khoantructiep","v":{"v":233600,"d":"233,600"}},{"$f":"E190*KhongOndinhSX","v":0},{"$f":"E190*thuhut","v":0},null,null,{"$f":"ROUND(SUM(E190:L190)/26,0)","v":{"v":268631,"d":"268,631"}}]
[{"$nulls":3},3.28,{"$f":"D191*LTTV","v":{"v":6560000,"d":"6,560,000"}},{"$f":"$F$10","v":{"v":210000,"d":"210,000"}},{"$f":"E191*luongphu","v":{"v":787200,"d":"787,200"}},{"$f":"E191*khoantructiep","v":{"v":262400,"d":"262,400"}},{"$f":"E191*KhongOndinhSX","v":0},{"$f":"E191*thuhut","v":0},null,null,{"$f":"ROUND(SUM(E191:L191)/26,0)","v":{"v":300754,"d":"300,754"}}]
["3. Phục vụ viên"]
[{"$nulls":3},1.55,{"$f":"D193*LTTV","v":{"v":3100000,"d":"3,100,000"}},{"$f":"$F$10","v":{"v":210000,"d":"210,000"}},{"$f":"E193*luongphu","v":{"v":372000,"d":"372,000"}},{"$f":"E193*khoantructiep","v":{"v":124000,"d":"124,000"}},{"$f":"E193*KhongOndinhSX","v":0},{"$f":"E193*thuhut","v":0},null,null,{"$f":"ROUND(SUM(E193:L193)/26,0)","v":{"v":146385,"d":"146,385"}}]
[{"$nulls":3},1.75,{"$f":"D194*LTTV","v":{"v":3500000,"d":"3,500,000"}},{"$f":"$F$10","v":{"v":210000,"d":"210,000"}},{"$f":"E194*luongphu","v":{"v":420000,"d":"420,000"}},{"$f":"E194*khoantructiep","v":{"v":140000,"d":"140,000"}},{"$f":"E194*KhongOndinhSX","v":0},{"$f":"E194*thuhut","v":0},null,null,{"$f":"ROUND(SUM(E194:L194)/26,0)","v":{"v":164231,"d":"164,231"}}]
[{"$nulls":3},2.05,{"$f":"D195*LTTV","v":{"v":4099999.9999999995,"d":"4,100,000"}},{"$f":"$F$10","v":{"v":210000,"d":"210,000"}},{"$f":"E195*luongphu","v":{"v":491999.99999999994,"d":"492,000"}},{"$f":"E195*khoantructiep","v":{"v":163999.99999999997,"d":"164,000"}},{"$f":"E195*KhongOndinhSX","v":0},{"$f":"E195*thuhut","v":0},null,null,{"$f":"ROUND(SUM(E195:L195)/26,0)","v":{"v":191000,"d":"191,000"}}]
[{"$nulls":3},2.35,{"$f":"D196*LTTV","v":{"v":4700000,"d":"4,700,000"}},{"$f":"$F$10","v":{"v":210000,"d":"210,000"}},{"$f":"E196*luongphu","v":{"v":564000,"d":"564,000"}},{"$f":"E196*khoantructiep","v":{"v":188000,"d":"188,000"}},{"$f":"E196*KhongOndinhSX","v":0},{"$f":"E196*thuhut","v":0},null,null,{"$f":"ROUND(SUM(E196:L196)/26,0)","v":{"v":217769,"d":"217,769"}}]
[]
["Các chức danh quản lý vận hành luồng tàu biển VTS vận dụng xếp như Kiểm soát viên không lưu Bảng lương công nhân viên Hàng không dân dụng (B.8):"]
[" - Kiểm soát viên từ phao số 0 vào cảng toàn tuyến xếp như Kiểm soát viên không lưu cấp III."]
[" - Kiểm soát viên quản lý vận hành luồng tàu xếp như Kiểm soát viên không lưu cấp II."]
[" - Kiểm soát viên quản lý vận hành khu vực luồng tàu xếp như Kiểm soát viên không lưu cấp I."]
["B.2. BẢNG LƯƠNG THUYỀN VIÊN VÀ CÔNG NHÂN VIÊN TÀU VẬN TẢI BIỂN, VẬN TẢI SÔNG, TÀU DỊCH VỤ DẦU KHÍ, TÀU CẨU DẦU KHÍ (TIẾP THEO)"]
["B.2.I.3. Tàu vận tải sông theo nhóm tàu"]
["CHỨC DANH THEO NHÓM TÀU"]
["1. Thuyền trưởng"]
[null,null,"Nhóm I",2.81,{"$f":"D206*LTTV","v":{"v":5620000,"d":"5,620,000"}},{"$f":"$F$10","v":{"v":210000,"d":"210,000"}},{"$f":"E206*luongphu","v":{"v":674400,"d":"674,400"}},{"$f":"E206*khoantructiep","v":{"v":224800,"d":"224,800"}},{"$f":"E206*KhongOndinhSX","v":0},{"$f":"E206*thuhut","v":0},null,null,{"$f":"ROUND(SUM(E206:L206)/26,0)","v":{"v":258815,"d":"258,815"}}]
[{"$nulls":3},2.99,{"v":5980000,"d":"5,980,000"},{"v":210000,"d":"210,000"},{"v":717600,"d":"717,600"},{"v":239200,"d":"239,200"},0,0,null,null,{"v":274877,"d":"274,877"}]
[null,null,"Nhóm II",3.73,{"v":7460000,"d":"7,460,000"},{"v":210000,"d":"210,000"},{"v":895200,"d":"895,200"},{"v":298400,"d":"298,400"},0,0,null,null,{"v":340908,"d":"340,908"}]
[{"$nulls":3},3.91,{"v":7820000,"d":"7,820,000"},{"v":210000,"d":"210,000"},{"v":938400,"d":"938,400"},{"v":312800,"d":"312,800"},0,0,null,null,{"v":356969,"d":"356,969"}]
[null,null,"Nhóm III",4.14,{"v":8279999.999999999,"d":"8,280,000"},{"v":210000,"d":"210,000"},{"v":993599.9999999999,"d":"993,600"},{"v":331199.99999999994,"d":"331,200"},0,0,null,null,{"v":377492,"d":"377,492"}]
[{"$nulls":3},4.36,{"v":8720000,"d":"8,720,000"},{"v":210000,"d":"210,000"},{"v":1046400,"d":"1,046,400"},{"v":348800,"d":"348,800"},0,0,null,null,{"v":397123,"d":"397,123"}]
[null,null,"Nhóm IV",4.68,{"v":9360000,"d":"9,360,000"},{"v":210000,"d":"210,000"},{"v":1123200,"d":"1,123,200"},{"v":374400,"d":"374,400"},0,0,null,null,{"v":425677,"d":"425,677"}]
[{"$nulls":3},4.92,{"v":9840000,"d":"9,840,000"},{"v":210000,"d":"210,000"},{"v":1180800,"d":"1,180,800"},{"v":393600,"d":"393,600"},0,0,null,null,{"v":447092,"d":"447,092"}]
["2. Đại phó, máy trưởng"]
[null,null,"Nhóm I",2.51,{"$f":"D215*LTTV","v":{"v":5020000,"d":"5,020,000"}},{"$f":"$F$10","v":{"v":210000,"d":"210,000"}},{"$f":"E215*luongphu","v":{"v":602400,"d":"602,400"}},{"$f":"E215*khoantructiep","v":{"v":200800,"d":"200,800"}},{"$f":"E215*KhongOndinhSX","v":0},{"$f":"E215*thuhut","v":0},null,null,{"$f":"ROUND(SUM(E215:L215)/26,0)","v":{"v":232046,"d":"232,046"}}]
[{"$nulls":3},2.66,{"v":5320000,"d":"5,320,000"},{"v":210000,"d":"210,000"},{"v":638400,"d":"638,400"},{"v":212800,"d":"212,800"},0,0,null,null,{"v":245431,"d":"245,431"}]
[null,null,"Nhóm II",3.17,{"v":6340000,"d":"6,340,000"},{"v":210000,"d":"210,000"},{"v":760800,"d":"760,800"},{"v":253600,"d":"253,600"},0,0,null,null,{"v":290938,"d":"290,938"}]
[{"$nulls":3},{"v":3.3,"d":"3.30"},{"v":6600000,"d":"6,600,000"},{"v":210000,"d":"210,000"},{"v":792000,"d":"792,000"},{"v":264000,"d":"264,000"},0,0,null,null,{"v":302538,"d":"302,538"}]
[null,null,"Nhóm III",3.55,{"v":7100000,"d":"7,100,000"},{"v":210000,"d":"210,000"},{"v":852000,"d":"852,000"},{"v":284000,"d":"284,000"},0,0,null,null,{"v":324846,"d":"324,846"}]
[{"$nulls":3},3.76,{"v":7520000,"d":"7,520,000"},{"v":210000,"d":"210,000"},{"v":902400,"d":"902,400"},{"v":300800,"d":"300,800"},0,0,null,null,{"v":343585,"d":"343,585"}]
[null,null,"Nhóm IV",4.16,{"v":8320000,"d":"8,320,000"},{"v":210000,"d":"210,000"},{"v":998400,"d":"998,400"},{"v":332800,"d":"332,800"},0,0,null,null,{"v":379277,"d":"379,277"}]
[{"$nulls":3},4.37,{"v":8740000,"d":"8,740,000"},{"v":210000,"d":"210,000"},{"v":1048800,"d":"1,048,800"},{"v":349600,"d":"349,600"},0,0,null,null,{"v":398015,"d":"398,015"}]
["3. Thuyền phó 2, máy 2"]
[null,null,"Nhóm I"]
[]
[null,null,"Nhóm II",2.66,{"$f":"D226*LTTV","v":{"v":5320000,"d":"5,320,000"}},{"$f":"$F$10","v":{"v":210000,"d":"210,000"}},{"$f":"E226*luongphu","v":{"v":638400,"d":"638,400"}},{"$f":"E226*khoantructiep","v":{"v":212800,"d":"212,800"}},{"$f":"E226*KhongOndinhSX","v":0},{"$f":"E226*thuhut","v":0},null,null,{"$f":"ROUND(SUM(E226:L226)/26,0)","v":{"v":245431,"d":"245,431"}}]
[{"$nulls":3},2.81,{"v":5620000,"d":"5,620,000"},{"v":210000,"d":"210,000"},{"v":674400,"d":"674,400"},{"v":224800,"d":"224,800"},0,0,null,null,{"v":258815,"d":"258,815"}]
[null,null,"Nhóm III",2.93,{"v":5860000,"d":"5,860,000"},{"v":210000,"d":"210,000"},{"v":703200,"d":"703,200"},{"v":234400,"d":"234,400"},0,0,null,null,{"v":269523,"d":"269,523"}]
[{"$nulls":3},{"v":3.1,"d":"3.10"},{"v":6200000,"d":"6,200,000"},{"v":210000,"d":"210,000"},{"v":744000,"d":"744,000"},{"v":248000,"d":"248,000"},0,0,null,null,{"v":284692,"d":"284,692"}]
[null,null,"Nhóm IV",3.55,{"v":7100000,"d":"7,100,000"},{"v":210000,"d":"210,000"},{"v":852000,"d":"852,000"},{"v":284000,"d":"284,000"},0,0,null,null,{"v":324846,"d":"324,846"}]
[{"$nulls":3},3.76,{"v":7520000,"d":"7,520,000"},{"v":210000,"d":"210,000"},{"v":902400,"d":"902,400"},{"v":300800,"d":"300,800"},0,0,null,null,{"v":343585,"d":"343,585"}]
["Nhóm I: Phương tiện không có động cơ có trọng tải toàn phần từ 5 tấn đến 15 tấn; phương tiện có trọng tải động cơ có công suất máy chính từ 5 mã lực"]
["đến 15 mã lực hoặc sức chở từ 5 người đến 12 người."]
["Nhóm II: Tàu khách có sức chở từ trên 12 người đến 50 người; phà có trọng tải toàn phần đến 50 tấn; đoàn lai có trọng tải toàn phần đến 400 tấn;"]
["phương tiện có tổng công suất máy chính từ trên 15 mã lực đến 150 mã lực."]
["Nhóm III: Tàu khách có sức chở từ trên 50 người đến 100 người; phà có trọng tải toàn phần trên 50 tấn đến 150 tấn; phương tiện chở hàng có trọng tải"]
["toàn phần trên 150 tấn đến 500 tấn; đoàn lai có trọng tải toàn phần trên 400 tấn đến đồng tấn; phương tiện"]
["Nhóm IV: Tàu khách có sức chở trên 100 người; phà có trọng tải toàn phần trên 150 tấn; phương tiện chở hàng có trọng tải toàn phần trên 500 tấn;"]
["đoàn lai có trọng tải toàn phần trên đồng tấn; phương tiện có tổng công suất máy chính trên 400 mã lực."]
["B.5. BẢNG LƯƠNG THUYỀN VIÊN VÀ CÔNG NHÂN VIÊN TÀU CÔNG TRÌNH, TÀU TRỤC VỚT VÀ CỨU HỘ, TÀU THAY THẢ PHAO, TÀU TÌM KIẾM CỨU NẠN"]
["HÀNG HẢI (TIẾP THEO)"]
["B.5.I. TÀU CÔNG TRÌNH"]
["2/ Tàu nạo vét sông"]
["CHỨC DANH THEO NHÓM TÀU"]
["1. Thuyền trưởng"]
["Tàu hút dưới 150m3/h"]
[{"$nulls":3},3.91,{"$f":"D247*LTTV","v":{"v":7820000,"d":"7,820,000"}},{"$f":"$F$10","v":{"v":210000,"d":"210,000"}},{"$f":"E247*luongphu","v":{"v":938400,"d":"938,400"}},{"$f":"E247*khoantructiep","v":{"v":312800,"d":"312,800"}},{"$f":"E247*KhongOndinhSX","v":0},{"$f":"E247*thuhut","v":0},null,null,{"$f":"ROUND(SUM(E247:L247)/26,0)","v":{"v":356969,"d":"356,969"}}]
[{"$nulls":3},4.16,{"$f":"D248*LTTV","v":{"v":8320000,"d":"8,320,000"}},{"$f":"$F$10","v":{"v":210000,"d":"210,000"}},{"$f":"E248*luongphu","v":{"v":998400,"d":"998,400"}},{"$f":"E248*khoantructiep","v":{"v":332800,"d":"332,800"}},{"$f":"E248*KhongOndinhSX","v":0},{"$f":"E248*thuhut","v":0},null,null,{"$f":"ROUND(SUM(E248:L248)/26,0)","v":{"v":379277,"d":"379,277"}}]
["Tàu hút từ 150m3/h đến 300m3/h"]
[{"$nulls":3},4.37,{"$f":"D250*LTTV","v":{"v":8740000,"d":"8,740,000"}},{"$f":"$F$10","v":{"v":210000,"d":"210,000"}},{"$f":"E250*luongphu","v":{"v":1048800,"d":"1,048,800"}},{"$f":"E250*khoantructiep","v":{"v":349600,"d":"349,600"}},{"$f":"E250*KhongOndinhSX","v":0},{"$f":"E250*thuhut","v":0},null,null,{"$f":"ROUND(SUM(E250:L250)/26,0)","v":{"v":398015,"d":"398,015"}}]
[{"$nulls":3},4.68,{"$f":"D251*LTTV","v":{"v":9360000,"d":"9,360,000"}},{"$f":"$F$10","v":{"v":210000,"d":"210,000"}},{"$f":"E251*luongphu","v":{"v":1123200,"d":"1,123,200"}},{"$f":"E251*khoantructiep","v":{"v":374400,"d":"374,400"}},{"$f":"E251*KhongOndinhSX","v":0},{"$f":"E251*thuhut","v":0},null,null,{"$f":"ROUND(SUM(E251:L251)/26,0)","v":{"v":425677,"d":"425,677"}}]
["Tàu hút trên 300m3/h, tàu cuốc dưới 300m3/h"]
[{"$nulls":3},4.88,{"$f":"D253*LTTV","v":{"v":9760000,"d":"9,760,000"}},{"$f":"$F$10","v":{"v":210000,"d":"210,000"}},{"$f":"E253*luongphu","v":{"v":1171200,"d":"1,171,200"}},{"$f":"E253*khoantructiep","v":{"v":390400,"d":"390,400"}},{"$f":"E253*KhongOndinhSX","v":0},{"$f":"E253*thuhut","v":0},null,null,{"$f":"ROUND(SUM(E253:L253)/26,0)","v":{"v":443523,"d":"443,523"}}]
[{"$nulls":3},5.19,{"$f":"D254*LTTV","v":{"v":10380000,"d":"10,380,000"}},{"$f":"$F$10","v":{"v":210000,"d":"210,000"}},{"$f":"E254*luongphu","v":{"v":1245600,"d":"1,245,600"}},{"$f":"E254*khoantructiep","v":{"v":415200,"d":"415,200"}},{"$f":"E254*KhongOndinhSX","v":0},{"$f":"E254*thuhut","v":0},null,null,{"$f":"ROUND(SUM(E254:L254)/26,0)","v":{"v":471185,"d":"471,185"}}]
["2. Máy trưởng"]
[{"$nulls":3},{"v":3.5,"d":"3.50"},{"$f":"D256*LTTV","v":{"v":7000000,"d":"7,000,000"}},{"$f":"$F$10","v":{"v":210000,"d":"210,000"}},{"$f":"E256*luongphu","v":{"v":840000,"d":"840,000"}},{"$f":"E256*khoantructiep","v":{"v":280000,"d":"280,000"}},{"$f":"E256*KhongOndinhSX","v":0},{"$f":"E256*thuhut","v":0},null,null,{"$f":"ROUND(SUM(E256:L256)/26,0)","v":{"v":320385,"d":"320,385"}}]
[{"$nulls":3},3.73,{"v":7460000,"d":"7,460,000"},{"v":210000,"d":"210,000"},{"v":895200,"d":"895,200"},{"v":298400,"d":"298,400"},0,0,null,null,{"v":340908,"d":"340,908"}]
[{"$nulls":3},4.16,{"v":8320000,"d":"8,320,000"},{"v":210000,"d":"210,000"},{"v":998400,"d":"998,400"},{"v":332800,"d":"332,800"},0,0,null,null,{"v":379277,"d":"379,277"}]
[{"$nulls":3},4.37,{"v":8740000,"d":"8,740,000"},{"v":210000,"d":"210,000"},{"v":1048800,"d":"1,048,800"},{"v":349600,"d":"349,600"},0,0,null,null,{"v":398015,"d":"398,015"}]
[{"$nulls":3},4.71,{"v":9420000,"d":"9,420,000"},{"v":210000,"d":"210,000"},{"v":1130400,"d":"1,130,400"},{"v":376800,"d":"376,800"},0,0,null,null,{"v":428354,"d":"428,354"}]
[{"$nulls":3},5.07,{"v":10140000,"d":"10,140,000"},{"v":210000,"d":"210,000"},{"v":1216800,"d":"1,216,800"},{"v":405600,"d":"405,600"},0,0,null,null,{"v":460477,"d":"460,477"}]
["3. Điện trưởng"]
["Tàu hút trên 300m3/h. Tàu cuốc dưới 300m3/h"]
[{"$nulls":3},4.16,{"$f":"D264*LTTV","v":{"v":8320000,"d":"8,320,000"}},{"$f":"$F$10","v":{"v":210000,"d":"210,000"}},{"$f":"E264*luongphu","v":{"v":998400,"d":"998,400"}},{"$f":"E264*khoantructiep","v":{"v":332800,"d":"332,800"}},{"$f":"E264*KhongOndinhSX","v":0},{"$f":"E264*thuhut","v":0},null,null,{"$f":"ROUND(SUM(E264:L264)/26,0)","v":{"v":379277,"d":"379,277"}}]
[{"$nulls":3},4.36,{"$f":"D265*LTTV","v":{"v":8720000,"d":"8,720,000"}},{"$f":"$F$10","v":{"v":210000,"d":"210,000"}},{"$f":"E265*luongphu","v":{"v":1046400,"d":"1,046,400"}},{"$f":"E265*khoantructiep","v":{"v":348800,"d":"348,800"}},{"$f":"E265*KhongOndinhSX","v":0},{"$f":"E265*thuhut","v":0},null,null,{"$f":"ROUND(SUM(E265:L265)/26,0)","v":{"v":397123,"d":"397,123"}}]
["4. Máy 2, kỹ thuật viên cuốc 1"]
[{"$nulls":3},3.48,{"$f":"D267*LTTV","v":{"v":6960000,"d":"6,960,000"}},{"$f":"$F$10","v":{"v":210000,"d":"210,000"}},{"$f":"E267*luongphu","v":{"v":835200,"d":"835,200"}},{"$f":"E267*khoantructiep","v":{"v":278400,"d":"278,400"}},{"$f":"E267*KhongOndinhSX","v":0},{"$f":"E267*thuhut","v":0},null,null,{"$f":"ROUND(SUM(E267:L267)/26,0)","v":{"v":318600,"d":"318,600"}}]
[{"$nulls":3},3.71,{"v":7420000,"d":"7,420,000"},{"v":210000,"d":"210,000"},{"v":890400,"d":"890,400"},{"v":296800,"d":"296,800"},0,0,null,null,{"v":339123,"d":"339,123"}]
[{"$nulls":3},4.09,{"v":8180000,"d":"8,180,000"},{"v":210000,"d":"210,000"},{"v":981600,"d":"981,600"},{"v":327200,"d":"327,200"},0,0,null,null,{"v":373031,"d":"373,031"}]
[{"$nulls":3},{"v":4.3,"d":"4.30"},{"v":8600000,"d":"8,600,000"},{"v":210000,"d":"210,000"},{"v":1032000,"d":"1,032,000"},{"v":344000,"d":"344,000"},0,0,null,null,{"v":391769,"d":"391,769"}]
[{"$nulls":3},4.68,{"v":9360000,"d":"9,360,000"},{"v":210000,"d":"210,000"},{"v":1123200,"d":"1,123,200"},{"v":374400,"d":"374,400"},0,0,null,null,{"v":425677,"d":"425,677"}]
[{"$nulls":3},4.92,{"v":9840000,"d":"9,840,000"},{"v":210000,"d":"210,000"},{"v":1180800,"d":"1,180,800"},{"v":393600,"d":"393,600"},0,0,null,null,{"v":447092,"d":"447,092"}]
["5. Máy 3, kỹ thuật viên cuốc 2"]
[{"$nulls":3},3.17,{"$f":"D274*LTTV","v":{"v":6340000,"d":"6,340,000"}},{"$f":"$F$10","v":{"v":210000,"d":"210,000"}},{"$f":"E274*luongphu","v":{"v":760800,"d":"760,800"}},{"$f":"E274*khoantructiep","v":{"v":253600,"d":"253,600"}},{"$f":"E274*KhongOndinhSX","v":0},{"$f":"E274*thuhut","v":0},null,null,{"$f":"ROUND(SUM(E274:L274)/26,0)","v":{"v":290938,"d":"290,938"}}]
[{"$nulls":3},{"v":3.5,"d":"3.50"},{"v":7000000,"d":"7,000,000"},{"v":210000,"d":"210,000"},{"v":840000,"d":"840,000"},{"v":280000,"d":"280,000"},0,0,null,null,{"v":320385,"d":"320,385"}]
[{"$nulls":3},3.73,{"v":7460000,"d":"7,460,000"},{"v":210000,"d":"210,000"},{"v":895200,"d":"895,200"},{"v":298400,"d":"298,400"},0,0,null,null,{"v":340908,"d":"340,908"}]
[{"$nulls":3},3.91,{"v":7820000,"d":"7,820,000"},{"v":210000,"d":"210,000"},{"v":938400,"d":"938,400"},{"v":312800,"d":"312,800"},0,0,null,null,{"v":356969,"d":"356,969"}]
[{"$nulls":3},4.37,{"v":8740000,"d":"8,740,000"},{"v":210000,"d":"210,000"},{"v":1048800,"d":"1,048,800"},{"v":349600,"d":"349,600"},0,0,null,null,{"v":398015,"d":"398,015"}]
[{"$nulls":3},4.68,{"v":9360000,"d":"9,360,000"},{"v":210000,"d":"210,000"},{"v":1123200,"d":"1,123,200"},{"v":374400,"d":"374,400"},0,0,null,null,{"v":425677,"d":"425,677"}]
["6. Máy 4, kỹ thuật viên cuốc 3"]
[{"$nulls":3},4.16,{"$f":"D281*LTTV","v":{"v":8320000,"d":"8,320,000"}},{"$f":"$F$10","v":{"v":210000,"d":"210,000"}},{"$f":"E281*luongphu","v":{"v":998400,"d":"998,400"}},{"$f":"E281*khoantructiep","v":{"v":332800,"d":"332,800"}},{"$f":"E281*KhongOndinhSX","v":0},{"$f":"E281*thuhut","v":0},null,null,{"$f":"ROUND(SUM(E281:L281)/26,0)","v":{"v":379277,"d":"379,277"}}]
[{"$nulls":3},4.36,{"$f":"D282*LTTV","v":{"v":8720000,"d":"8,720,000"}},{"$f":"$F$10","v":{"v":210000,"d":"210,000"}},{"$f":"E282*luongphu","v":{"v":1046400,"d":"1,046,400"}},{"$f":"E282*khoantructiep","v":{"v":348800,"d":"348,800"}},{"$f":"E282*KhongOndinhSX","v":0},{"$f":"E282*thuhut","v":0},null,null,{"$f":"ROUND(SUM(E282:L282)/26,0)","v":{"v":397123,"d":"397,123"}}]
["7. Quản trị trưởng, thuỷ thủ trưởng"]
[{"$nulls":3},{"v":3.5,"d":"3.50"},{"$f":"D284*LTTV","v":{"v":7000000,"d":"7,000,000"}},{"$f":"$F$10","v":{"v":210000,"d":"210,000"}},{"$f":"E284*luongphu","v":{"v":840000,"d":"840,000"}},{"$f":"E284*khoantructiep","v":{"v":280000,"d":"280,000"}},{"$f":"E284*KhongOndinhSX","v":0},{"$f":"E284*thuhut","v":0},null,null,{"$f":"ROUND(SUM(E284:L284)/26,0)","v":{"v":320385,"d":"320,385"}}]
[{"$nulls":3},3.73,{"$f":"D285*LTTV","v":{"v":7460000,"d":"7,460,000"}},{"$f":"$F$10","v":{"v":210000,"d":"210,000"}},{"$f":"E285*luongphu","v":{"v":895200,"d":"895,200"}},{"$f":"E285*khoantructiep","v":{"v":298400,"d":"298,400"}},{"$f":"E285*KhongOndinhSX","v":0},{"$f":"E285*thuhut","v":0},null,null,{"$f":"ROUND(SUM(E285:L285)/26,0)","v":{"v":340908,"d":"340,908"}}]
["CHỨC DANH KHÔNG THEO NHÓM TÀU"]
["1. Thợ máy, điện, điện báo"]
[null,null,"1/4",2.05,{"$f":"D288*LTTV","v":{"v":4099999.9999999995,"d":"4,100,000"}},{"$f":"$F$10","v":{"v":210000,"d":"210,000"}},{"$f":"E288*luongphu","v":{"v":491999.99999999994,"d":"492,000"}},{"$f":"E288*khoantructiep","v":{"v":163999.99999999997,"d":"164,000"}},{"$f":"E288*KhongOndinhSX","v":0},{"$f":"E288*thuhut","v":0},null,null,{"$f":"ROUND(SUM(E288:L288)/26,0)","v":{"v":191000,"d":"191,000"}}]
[null,null,"2/4",2.35,{"$f":"D289*LTTV","v":{"v":4700000,"d":"4,700,000"}},{"$f":"$F$10","v":{"v":210000,"d":"210,000"}},{"$f":"E289*luongphu","v":{"v":564000,"d":"564,000"}},{"$f":"E289*khoantructiep","v":{"v":188000,"d":"188,000"}},{"$f":"E289*KhongOndinhSX","v":0},{"$f":"E289*thuhut","v":0},null,null,{"$f":"ROUND(SUM(E289:L289)/26,0)","v":{"v":217769,"d":"217,769"}}]
[null,null,"3/4",2.66,{"$f":"D290*LTTV","v":{"v":5320000,"d":"5,320,000"}},{"$f":"$F$10","v":{"v":210000,"d":"210,000"}},{"$f":"E290*luongphu","v":{"v":638400,"d":"638,400"}},{"$f":"E290*khoantructiep","v":{"v":212800,"d":"212,800"}},{"$f":"E290*KhongOndinhSX","v":0},{"$f":"E290*thuhut","v":0},null,null,{"$f":"ROUND(SUM(E290:L290)/26,0)","v":{"v":245431,"d":"245,431"}}]
[null,null,"4/4",2.99,{"$f":"D291*LTTV","v":{"v":5980000,"d":"5,980,000"}},{"$f":"$F$10","v":{"v":210000,"d":"210,000"}},{"$f":"E291*luongphu","v":{"v":717600,"d":"717,600"}},{"$f":"E291*khoantructiep","v":{"v":239200,"d":"239,200"}},{"$f":"E291*KhongOndinhSX","v":0},{"$f":"E291*thuhut","v":0},null,null,{"$f":"ROUND(SUM(E291:L291)/26,0)","v":{"v":274877,"d":"274,877"}}]
["2. Thuỷ thủ"]
[null,null,"1/4",1.93,{"$f":"D293*LTTV","v":{"v":3860000,"d":"3,860,000"}},{"$f":"$F$10","v":{"v":210000,"d":"210,000"}},{"$f":"E293*luongphu","v":{"v":463200,"d":"463,200"}},{"$f":"E293*khoantructiep","v":{"v":154400,"d":"154,400"}},{"$f":"E293*KhongOndinhSX","v":0},{"$f":"E293*thuhut","v":0},null,null,{"$f":"ROUND(SUM(E293:L293)/26,0)","v":{"v":180292,"d":"180,292"}}]
[null,null,"2/4",2.18,{"$f":"D294*LTTV","v":{"v":4360000,"d":"4,360,000"}},{"$f":"$F$10","v":{"v":210000,"d":"210,000"}},{"$f":"E294*luongphu","v":{"v":523200,"d":"523,200"}},{"$f":"E294*khoantructiep","v":{"v":174400,"d":"174,400"}},{"$f":"E294*KhongOndinhSX","v":0},{"$f":"E294*thuhut","v":0},null,null,{"$f":"ROUND(SUM(E294:L294)/26,0)","v":{"v":202600,"d":"202,600"}}]
[null,"N304TTvs","3/4",2.51,{"$f":"D295*LTTV","v":{"v":5020000,"d":"5,020,000"}},{"$f":"$F$10","v":{"v":210000,"d":"210,000"}},{"$f":"E295*luongphu","v":{"v":602400,"d":"602,400"}},{"$f":"E295*khoantructiep","v":{"v":200800,"d":"200,800"}},{"$f":"E295*KhongOndinhSX","v":0},{"$f":"E295*thuhut","v":0},null,null,{"$f":"ROUND(SUM(E295:L295)/26,0)","v":{"v":232046,"d":"232,046"}}]
[null,"N404TTvs","4/4",2.83,{"$f":"D296*LTTV","v":{"v":5660000,"d":"5,660,000"}},{"$f":"$F$10","v":{"v":210000,"d":"210,000"}},{"$f":"E296*luongphu","v":{"v":679200,"d":"679,200"}},{"$f":"E296*khoantructiep","v":{"v":226400,"d":"226,400"}},{"$f":"E296*KhongOndinhSX","v":0},{"$f":"E296*thuhut","v":0},null,null,{"$f":"ROUND(SUM(E296:L296)/26,0)","v":{"v":260600,"d":"260,600"}}]
["3. Phục vụ viên"]
[null,null,"1/4",1.55,{"$f":"D298*LTTV","v":{"v":3100000,"d":"3,100,000"}},{"$f":"$F$10","v":{"v":210000,"d":"210,000"}},{"$f":"E298*luongphu","v":{"v":372000,"d":"372,000"}},{"$f":"E298*khoantructiep","v":{"v":124000,"d":"124,000"}},{"$f":"E298*KhongOndinhSX","v":0},{"$f":"E298*thuhut","v":0},null,null,{"$f":"ROUND(SUM(E298:L298)/26,0)","v":{"v":146385,"d":"146,385"}}]
[null,null,"2/4",1.75,{"$f":"D299*LTTV","v":{"v":3500000,"d":"3,500,000"}},{"$f":"$F$10","v":{"v":210000,"d":"210,000"}},{"$f":"E299*luongphu","v":{"v":420000,"d":"420,000"}},{"$f":"E299*khoantructiep","v":{"v":140000,"d":"140,000"}},{"$f":"E299*KhongOndinhSX","v":0},{"$f":"E299*thuhut","v":0},null,null,{"$f":"ROUND(SUM(E299:L299)/26,0)","v":{"v":164231,"d":"164,231"}}]
[null,"Nvs274","2,7/4",1.96,{"$f":"D300*LTTV","v":{"v":3920000,"d":"3,920,000"}},{"$f":"$F$10","v":{"v":210000,"d":"210,000"}},{"$f":"E300*luongphu","v":{"v":470400,"d":"470,400"}},{"$f":"E300*khoantructiep","v":{"v":156800,"d":"156,800"}},{"$f":"E300*KhongOndinhSX","v":0},{"$f":"E300*thuhut","v":0},null,null,{"$f":"ROUND(SUM(E300:L300)/26,0)","v":{"v":182969,"d":"182,969"}}]
[null,"Nvs304","3/4",2.05,{"$f":"D301*LTTV","v":{"v":4099999.9999999995,"d":"4,100,000"}},{"$f":"$F$10","v":{"v":210000,"d":"210,000"}},{"$f":"E301*luongphu","v":{"v":491999.99999999994,"d":"492,000"}},{"$f":"E301*khoantructiep","v":{"v":163999.99999999997,"d":"164,000"}},{"$f":"E301*KhongOndinhSX","v":0},{"$f":"E301*thuhut","v":0},null,null,{"$f":"ROUND(SUM(E301:L301)/26,0)","v":{"v":191000,"d":"191,000"}}]
[null,null,"4/4",2.35,{"$f":"D302*LTTV","v":{"v":4700000,"d":"4,700,000"}},{"$f":"$F$10","v":{"v":210000,"d":"210,000"}},{"$f":"E302*luongphu","v":{"v":564000,"d":"564,000"}},{"$f":"E302*khoantructiep","v":{"v":188000,"d":"188,000"}},{"$f":"E302*KhongOndinhSX","v":0},{"$f":"E302*thuhut","v":0},null,null,{"$f":"ROUND(SUM(E302:L302)/26,0)","v":{"v":217769,"d":"217,769"}}]
["4. Cấp dưỡng"]
[null,"Capduong.1s","1/4",1.75,{"$f":"D304*LTTV","v":{"v":3500000,"d":"3,500,000"}},{"$f":"$F$10","v":{"v":210000,"d":"210,000"}},{"$f":"E304*luongphu","v":{"v":420000,"d":"420,000"}},{"$f":"E304*khoantructiep","v":{"v":140000,"d":"140,000"}},{"$f":"E304*KhongOndinhSX","v":0},{"$f":"E304*thuhut","v":0},null,null,{"$f":"ROUND(SUM(E304:L304)/26,0)","v":{"v":164231,"d":"164,231"}}]
[null,"Capduong.2s","2/4",1.99,{"$f":"D305*LTTV","v":{"v":3980000,"d":"3,980,000"}},{"$f":"$F$10","v":{"v":210000,"d":"210,000"}},{"$f":"E305*luongphu","v":{"v":477600,"d":"477,600"}},{"$f":"E305*khoantructiep","v":{"v":159200,"d":"159,200"}},{"$f":"E305*KhongOndinhSX","v":0},{"$f":"E305*thuhut","v":0},null,null,{"$f":"ROUND(SUM(E305:L305)/26,0)","v":{"v":185646,"d":"185,646"}}]
[null,"Capduong.3s","3/4",2.35,{"$f":"D306*LTTV","v":{"v":4700000,"d":"4,700,000"}},{"$f":"$F$10","v":{"v":210000,"d":"210,000"}},{"$f":"E306*luongphu","v":{"v":564000,"d":"564,000"}},{"$f":"E306*khoantructiep","v":{"v":188000,"d":"188,000"}},{"$f":"E306*KhongOndinhSX","v":0},{"$f":"E306*thuhut","v":0},null,null,{"$f":"ROUND(SUM(E306:L306)/26,0)","v":{"v":217769,"d":"217,769"}}]
[null,"Capduong.4s","4/4",2.66,{"$f":"D307*LTTV","v":{"v":5320000,"d":"5,320,000"}},{"$f":"$F$10","v":{"v":210000,"d":"210,000"}},{"$f":"E307*luongphu","v":{"v":638400,"d":"638,400"}},{"$f":"E307*khoantructiep","v":{"v":212800,"d":"212,800"}},{"$f":"E307*KhongOndinhSX","v":0},{"$f":"E307*thuhut","v":0},null,null,{"$f":"ROUND(SUM(E307:L307)/26,0)","v":{"v":245431,"d":"245,431"}}]
["B.5. BẢNG LƯƠNG THUYỀN VIÊN VÀ CÔNG NHÂN VIÊN TÀU CÔNG TRÌNH, TÀU TRỤC VỚT VÀ CỨU HỘ, TÀU THAY THẢ PHAO, TÀU TÌM KIẾM CỨU NẠN"]
[" HÀNG HẢI"]
["I/ Tàu công trình"]
["1/ Tàu nạo vét biển "]
["CHỨC DANH THEO NHÓM TÀU"]
["1. Thuyền trưởng tàu hút bụng"]
["Tàu hút. tàu cuốc từ 300m3/h đến dưới 800m3/h"]
[{"$nulls":3},5.19,{"$f":"D315*LTTV","v":{"v":10380000,"d":"10,380,000"}},{"$f":"$F$10","v":{"v":210000,"d":"210,000"}},{"$f":"E315*luongphu","v":{"v":1245600,"d":"1,245,600"}},{"$f":"E315*khoantructiep","v":{"v":415200,"d":"415,200"}},{"$f":"E315*KhongOndinhSX","v":0},{"$f":"E315*thuhut","v":0},null,null,{"$f":"ROUND(SUM(E315:L315)/26,0)","v":{"v":471185,"d":"471,185"}}]
[{"$nulls":3},5.41,{"$f":"D316*LTTV","v":{"v":10820000,"d":"10,820,000"}},{"$f":"$F$10","v":{"v":210000,"d":"210,000"}},{"$f":"E316*luongphu","v":{"v":1298400,"d":"1,298,400"}},{"$f":"E316*khoantructiep","v":{"v":432800,"d":"432,800"}},{"$f":"E316*KhongOndinhSX","v":0},{"$f":"E316*thuhut","v":0},null,null,{"$f":"ROUND(SUM(E316:L316)/26,0)","v":{"v":490815,"d":"490,815"}}]
["Tàu hút. tàu cuốc từ 800m3/h trở lên"]
[{"$nulls":3},5.41,{"$f":"D318*LTTV","v":{"v":10820000,"d":"10,820,000"}},{"$f":"$F$10","v":{"v":210000,"d":"210,000"}},{"$f":"E318*luongphu","v":{"v":1298400,"d":"1,298,400"}},{"$f":"E318*khoantructiep","v":{"v":432800,"d":"432,800"}},{"$f":"E318*KhongOndinhSX","v":0},{"$f":"E318*thuhut","v":0},null,null,{"$f":"ROUND(SUM(E318:L318)/26,0)","v":{"v":490815,"d":"490,815"}}]
[{"$nulls":3},5.75,{"$f":"D319*LTTV","v":{"v":11500000,"d":"11,500,000"}},{"$f":"$F$10","v":{"v":210000,"d":"210,000"}},{"$f":"E319*luongphu","v":{"v":1380000,"d":"1,380,000"}},{"$f":"E319*khoantructiep","v":{"v":460000,"d":"460,000"}},{"$f":"E319*KhongOndinhSX","v":0},{"$f":"E319*thuhut","v":0},null,null,{"$f":"ROUND(SUM(E319:L319)/26,0)","v":{"v":521154,"d":"521,154"}}]
["2. Máy trưởng, thuyền trưởng tàu cuốc, tàu hút phun, tàu NV bằng gầu ngoạm"]
[{"$nulls":3},4.92,{"$f":"D321*LTTV","v":{"v":9840000,"d":"9,840,000"}},{"$f":"$F$10","v":{"v":210000,"d":"210,000"}},{"$f":"E321*luongphu","v":{"v":1180800,"d":"1,180,800"}},{"$f":"E321*khoantructiep","v":{"v":393600,"d":"393,600"}},{"$f":"E321*KhongOndinhSX","v":0},{"$f":"E321*thuhut","v":0},null,null,{"$f":"ROUND(SUM(E321:L321)/26,0)","v":{"v":447092,"d":"447,092"}}]
[{"$nulls":3},5.19,{"$f":"D322*LTTV","v":{"v":10380000,"d":"10,380,000"}},{"$f":"$F$10","v":{"v":210000,"d":"210,000"}},{"$f":"E322*luongphu","v":{"v":1245600,"d":"1,245,600"}},{"$f":"E322*khoantructiep","v":{"v":415200,"d":"415,200"}},{"$f":"E322*KhongOndinhSX","v":0},{"$f":"E322*thuhut","v":0},null,null,{"$f":"ROUND(SUM(E322:L322)/26,0)","v":{"v":471185,"d":"471,185"}}]
[{"$nulls":3},5.19,{"$f":"D323*LTTV","v":{"v":10380000,"d":"10,380,000"}},{"$f":"$F$10","v":{"v":210000,"d":"210,000"}},{"$f":"E323*luongphu","v":{"v":1245600,"d":"1,245,600"}},{"$f":"E323*khoantructiep","v":{"v":415200,"d":"415,200"}},{"$f":"E323*KhongOndinhSX","v":0},{"$f":"E323*thuhut","v":0},null,null,{"$f":"ROUND(SUM(E323:L323)/26,0)","v":{"v":471185,"d":"471,185"}}]
[{"$nulls":3},5.41,{"$f":"D324*LTTV","v":{"v":10820000,"d":"10,820,000"}},{"$f":"$F$10","v":{"v":210000,"d":"210,000"}},{"$f":"E324*luongphu","v":{"v":1298400,"d":"1,298,400"}},{"$f":"E324*khoantructiep","v":{"v":432800,"d":"432,800"}},{"$f":"E324*KhongOndinhSX","v":0},{"$f":"E324*thuhut","v":0},null,null,{"$f":"ROUND(SUM(E324:L324)/26,0)","v":{"v":490815,"d":"490,815"}}]
["3. Điện trưởng, đại phó tàu cuốc; kỹ thuật viên cuốc 1, tàu hút bụng; thuyền phó 2, máy 3 tàu hút bụng; máy 3, kỹ thuật viên"]
["cuốc 2 tàu cuốc, tàu hút phun, tàu nạo vét bằng gầu ngoạm"]
[{"$nulls":3},4.37,{"$f":"D327*LTTV","v":{"v":8740000,"d":"8,740,000"}},{"$f":"$F$10","v":{"v":210000,"d":"210,000"}},{"$f":"E327*luongphu","v":{"v":1048800,"d":"1,048,800"}},{"$f":"E327*khoantructiep","v":{"v":349600,"d":"349,600"}},{"$f":"E327*KhongOndinhSX","v":0},{"$f":"E327*thuhut","v":0},null,null,{"$f":"ROUND(SUM(E327:L327)/26,0)","v":{"v":398015,"d":"398,015"}}]
[{"$nulls":3},4.68,{"$f":"D328*LTTV","v":{"v":9360000,"d":"9,360,000"}},{"$f":"$F$10","v":{"v":210000,"d":"210,000"}},{"$f":"E328*luongphu","v":{"v":1123200,"d":"1,123,200"}},{"$f":"E328*khoantructiep","v":{"v":374400,"d":"374,400"}},{"$f":"E328*KhongOndinhSX","v":0},{"$f":"E328*thuhut","v":0},null,null,{"$f":"ROUND(SUM(E328:L328)/26,0)","v":{"v":425677,"d":"425,677"}}]
[{"$nulls":3},4.68,{"$f":"D329*LTTV","v":{"v":9360000,"d":"9,360,000"}},{"$f":"$F$10","v":{"v":210000,"d":"210,000"}},{"$f":"E329*luongphu","v":{"v":1123200,"d":"1,123,200"}},{"$f":"E329*khoantructiep","v":{"v":374400,"d":"374,400"}},{"$f":"E329*KhongOndinhSX","v":0},{"$f":"E329*thuhut","v":0},null,null,{"$f":"ROUND(SUM(E329:L329)/26,0)","v":{"v":425677,"d":"425,677"}}]
[{"$nulls":3},4.92,{"$f":"D330*LTTV","v":{"v":9840000,"d":"9,840,000"}},{"$f":"$F$10","v":{"v":210000,"d":"210,000"}},{"$f":"E330*luongphu","v":{"v":1180800,"d":"1,180,800"}},{"$f":"E330*khoantructiep","v":{"v":393600,"d":"393,600"}},{"$f":"E330*KhongOndinhSX","v":0},{"$f":"E330*thuhut","v":0},null,null,{"$f":"ROUND(SUM(E330:L330)/26,0)","v":{"v":447092,"d":"447,092"}}]
["4. Đại phó, máy 2 tàu hút bụng; máy 2, kỹ thuật viên cuốc 1 tàu cuốc, tàu hút phun, tàu NV bằng gầu ngoạm"]
[{"$nulls":3},4.68,{"$f":"D332*LTTV","v":{"v":9360000,"d":"9,360,000"}},{"$f":"$F$10","v":{"v":210000,"d":"210,000"}},{"$f":"E332*luongphu","v":{"v":1123200,"d":"1,123,200"}},{"$f":"E332*khoantructiep","v":{"v":374400,"d":"374,400"}},{"$f":"E332*KhongOndinhSX","v":0},{"$f":"E332*thuhut","v":0},null,null,{"$f":"ROUND(SUM(E332:L332)/26,0)","v":{"v":425677,"d":"425,677"}}]
[{"$nulls":3},4.92,{"$f":"D333*LTTV","v":{"v":9840000,"d":"9,840,000"}},{"$f":"$F$10","v":{"v":210000,"d":"210,000"}},{"$f":"E333*luongphu","v":{"v":1180800,"d":"1,180,800"}},{"$f":"E333*khoantructiep","v":{"v":393600,"d":"393,600"}},{"$f":"E333*KhongOndinhSX","v":0},{"$f":"E333*thuhut","v":0},null,null,{"$f":"ROUND(SUM(E333:L333)/26,0)","v":{"v":447092,"d":"447,092"}}]
[{"$nulls":3},4.92,{"$f":"D334*LTTV","v":{"v":9840000,"d":"9,840,000"}},{"$f":"$F$10","v":{"v":210000,"d":"210,000"}},{"$f":"E334*luongphu","v":{"v":1180800,"d":"1,180,800"}},{"$f":"E334*khoantructiep","v":{"v":393600,"d":"393,600"}},{"$f":"E334*KhongOndinhSX","v":0},{"$f":"E334*thuhut","v":0},null,null,{"$f":"ROUND(SUM(E334:L334)/26,0)","v":{"v":447092,"d":"447,092"}}]
[{"$nulls":3},5.19,{"$f":"D335*LTTV","v":{"v":10380000,"d":"10,380,000"}},{"$f":"$F$10","v":{"v":210000,"d":"210,000"}},{"$f":"E335*luongphu","v":{"v":1245600,"d":"1,245,600"}},{"$f":"E335*khoantructiep","v":{"v":415200,"d":"415,200"}},{"$f":"E335*KhongOndinhSX","v":0},{"$f":"E335*thuhut","v":0},null,null,{"$f":"ROUND(SUM(E335:L335)/26,0)","v":{"v":471185,"d":"471,185"}}]
["5. Thuyền phó 2 tàu cuốc, kỹ thuật viên cuốc 2 tàu hút; thuyền phó 3, máy 4 tàu hút bụng; máy 3, kỹ thuật viên cuốc 3 tàu cuốc, tàu hút phun,"]
["tàu NV bằng gầu ngoạm"]
[{"$nulls":3},4.16,{"$f":"D338*LTTV","v":{"v":8320000,"d":"8,320,000"}},{"$f":"$F$10","v":{"v":210000,"d":"210,000"}},{"$f":"E338*luongphu","v":{"v":998400,"d":"998,400"}},{"$f":"E338*khoantructiep","v":{"v":332800,"d":"332,800"}},{"$f":"E338*KhongOndinhSX","v":0},{"$f":"E338*thuhut","v":0},null,null,{"$f":"ROUND(SUM(E338:L338)/26,0)","v":{"v":379277,"d":"379,277"}}]
[{"$nulls":3},4.37,{"$f":"D339*LTTV","v":{"v":8740000,"d":"8,740,000"}},{"$f":"$F$10","v":{"v":210000,"d":"210,000"}},{"$f":"E339*luongphu","v":{"v":1048800,"d":"1,048,800"}},{"$f":"E339*khoantructiep","v":{"v":349600,"d":"349,600"}},{"$f":"E339*KhongOndinhSX","v":0},{"$f":"E339*thuhut","v":0},null,null,{"$f":"ROUND(SUM(E339:L339)/26,0)","v":{"v":398015,"d":"398,015"}}]
[{"$nulls":3},4.37,{"$f":"D340*LTTV","v":{"v":8740000,"d":"8,740,000"}},{"$f":"$F$10","v":{"v":210000,"d":"210,000"}},{"$f":"E340*luongphu","v":{"v":1048800,"d":"1,048,800"}},{"$f":"E340*khoantructiep","v":{"v":349600,"d":"349,600"}},{"$f":"E340*KhongOndinhSX","v":0},{"$f":"E340*thuhut","v":0},null,null,{"$f":"ROUND(SUM(E340:L340)/26,0)","v":{"v":398015,"d":"398,015"}}]
[{"$nulls":3},4.68,{"$f":"D341*LTTV","v":{"v":9360000,"d":"9,360,000"}},{"$f":"$F$10","v":{"v":210000,"d":"210,000"}},{"$f":"E341*luongphu","v":{"v":1123200,"d":"1,123,200"}},{"$f":"E341*khoantructiep","v":{"v":374400,"d":"374,400"}},{"$f":"E341*KhongOndinhSX","v":0},{"$f":"E341*thuhut","v":0},null,null,{"$f":"ROUND(SUM(E341:L341)/26,0)","v":{"v":425677,"d":"425,677"}}]
["6. Thuyền phó 3 tàu cuốc, tàu hút phun, tàu NV bằng gầu ngoạm, kỹ thuật viên cuốc 3 tàu hút bụng"]
[{"$nulls":3},3.91,{"$f":"D343*LTTV","v":{"v":7820000,"d":"7,820,000"}},{"$f":"$F$10","v":{"v":210000,"d":"210,000"}},{"$f":"E343*luongphu","v":{"v":938400,"d":"938,400"}},{"$f":"E343*khoantructiep","v":{"v":312800,"d":"312,800"}},{"$f":"E343*KhongOndinhSX","v":0},{"$f":"E343*thuhut","v":0},null,null,{"$f":"ROUND(SUM(E343:L343)/26,0)","v":{"v":356969,"d":"356,969"}}]
[{"$nulls":3},4.16,{"$f":"D344*LTTV","v":{"v":8320000,"d":"8,320,000"}},{"$f":"$F$10","v":{"v":210000,"d":"210,000"}},{"$f":"E344*luongphu","v":{"v":998400,"d":"998,400"}},{"$f":"E344*khoantructiep","v":{"v":332800,"d":"332,800"}},{"$f":"E344*KhongOndinhSX","v":0},{"$f":"E344*thuhut","v":0},null,null,{"$f":"ROUND(SUM(E344:L344)/26,0)","v":{"v":379277,"d":"379,277"}}]
[{"$nulls":3},4.16,{"$f":"D345*LTTV","v":{"v":8320000,"d":"8,320,000"}},{"$f":"$F$10","v":{"v":210000,"d":"210,000"}},{"$f":"E345*luongphu","v":{"v":998400,"d":"998,400"}},{"$f":"E345*khoantructiep","v":{"v":332800,"d":"332,800"}},{"$f":"E345*KhongOndinhSX","v":0},{"$f":"E345*thuhut","v":0},null,null,{"$f":"ROUND(SUM(E345:L345)/26,0)","v":{"v":379277,"d":"379,277"}}]
[{"$nulls":3},4.37,{"$f":"D346*LTTV","v":{"v":8740000,"d":"8,740,000"}},{"$f":"$F$10","v":{"v":210000,"d":"210,000"}},{"$f":"E346*luongphu","v":{"v":1048800,"d":"1,048,800"}},{"$f":"E346*khoantructiep","v":{"v":349600,"d":"349,600"}},{"$f":"E346*KhongOndinhSX","v":0},{"$f":"E346*thuhut","v":0},null,null,{"$f":"ROUND(SUM(E346:L346)/26,0)","v":{"v":398015,"d":"398,015"}}]
["7. Quản trị trưởng, thuỷ thủ trưởng"]
[{"$nulls":3},{"v":3.5,"d":"3.50"},{"$f":"D348*LTTV","v":{"v":7000000,"d":"7,000,000"}},{"$f":"$F$10","v":{"v":210000,"d":"210,000"}},{"$f":"E348*luongphu","v":{"v":840000,"d":"840,000"}},{"$f":"E348*khoantructiep","v":{"v":280000,"d":"280,000"}},{"$f":"E348*KhongOndinhSX","v":0},{"$f":"E348*thuhut","v":0},null,null,{"$f":"ROUND(SUM(E348:L348)/26,0)","v":{"v":320385,"d":"320,385"}}]
[{"$nulls":3},3.73,{"$f":"D349*LTTV","v":{"v":7460000,"d":"7,460,000"}},{"$f":"$F$10","v":{"v":210000,"d":"210,000"}},{"$f":"E349*luongphu","v":{"v":895200,"d":"895,200"}},{"$f":"E349*khoantructiep","v":{"v":298400,"d":"298,400"}},{"$f":"E349*KhongOndinhSX","v":0},{"$f":"E349*thuhut","v":0},null,null,{"$f":"ROUND(SUM(E349:L349)/26,0)","v":{"v":340908,"d":"340,908"}}]
[{"$nulls":3},3.73,{"$f":"D350*LTTV","v":{"v":7460000,"d":"7,460,000"}},{"$f":"$F$10","v":{"v":210000,"d":"210,000"}},{"$f":"E350*luongphu","v":{"v":895200,"d":"895,200"}},{"$f":"E350*khoantructiep","v":{"v":298400,"d":"298,400"}},{"$f":"E350*KhongOndinhSX","v":0},{"$f":"E350*thuhut","v":0},null,null,{"$f":"ROUND(SUM(E350:L350)/26,0)","v":{"v":340908,"d":"340,908"}}]
[{"$nulls":3},3.91,{"$f":"D351*LTTV","v":{"v":7820000,"d":"7,820,000"}},{"$f":"$F$10","v":{"v":210000,"d":"210,000"}},{"$f":"E351*luongphu","v":{"v":938400,"d":"938,400"}},{"$f":"E351*khoantructiep","v":{"v":312800,"d":"312,800"}},{"$f":"E351*KhongOndinhSX","v":0},{"$f":"E351*thuhut","v":0},null,null,{"$f":"ROUND(SUM(E351:L351)/26,0)","v":{"v":356969,"d":"356,969"}}]
["CHỨC DANH KHÔNG THEO NHÓM TÀU"]
["1. Thợ máy kiêm cơ khí"]
[{"$nulls":3},2.51,{"$f":"D354*LTTV","v":{"v":5020000,"d":"5,020,000"}},{"$f":"$F$10","v":{"v":210000,"d":"210,000"}},{"$f":"E354*luongphu","v":{"v":602400,"d":"602,400"}},{"$f":"E354*khoantructiep","v":{"v":200800,"d":"200,800"}},{"$f":"E354*KhongOndinhSX","v":0},{"$f":"E354*thuhut","v":0},null,null,{"$f":"ROUND(SUM(E354:L354)/26,0)","v":{"v":232046,"d":"232,046"}}]
[{"$nulls":3},2.83,{"$f":"D355*LTTV","v":{"v":5660000,"d":"5,660,000"}},{"$f":"$F$10","v":{"v":210000,"d":"210,000"}},{"$f":"E355*luongphu","v":{"v":679200,"d":"679,200"}},{"$f":"E355*khoantructiep","v":{"v":226400,"d":"226,400"}},{"$f":"E355*KhongOndinhSX","v":0},{"$f":"E355*thuhut","v":0},null,null,{"$f":"ROUND(SUM(E355:L355)/26,0)","v":{"v":260600,"d":"260,600"}}]
[{"$nulls":3},3.28,{"$f":"D356*LTTV","v":{"v":6560000,"d":"6,560,000"}},{"$f":"$F$10","v":{"v":210000,"d":"210,000"}},{"$f":"E356*luongphu","v":{"v":787200,"d":"787,200"}},{"$f":"E356*khoantructiep","v":{"v":262400,"d":"262,400"}},{"$f":"E356*KhongOndinhSX","v":0},{"$f":"E356*thuhut","v":0},null,null,{"$f":"ROUND(SUM(E356:L356)/26,0)","v":{"v":300754,"d":"300,754"}}]
[{"$nulls":3},3.91,{"$f":"D357*LTTV","v":{"v":7820000,"d":"7,820,000"}},{"$f":"$F$10","v":{"v":210000,"d":"210,000"}},{"$f":"E357*luongphu","v":{"v":938400,"d":"938,400"}},{"$f":"E357*khoantructiep","v":{"v":312800,"d":"312,800"}},{"$f":"E357*KhongOndinhSX","v":0},{"$f":"E357*thuhut","v":0},null,null,{"$f":"ROUND(SUM(E357:L357)/26,0)","v":{"v":356969,"d":"356,969"}}]
["2. Thợ máy, điện, điện báo"]
[{"$nulls":3},2.35,{"$f":"D359*LTTV","v":{"v":4700000,"d":"4,700,000"}},{"$f":"$F$10","v":{"v":210000,"d":"210,000"}},{"$f":"E359*luongphu","v":{"v":564000,"d":"564,000"}},{"$f":"E359*khoantructiep","v":{"v":188000,"d":"188,000"}},{"$f":"E359*KhongOndinhSX","v":0},{"$f":"E359*thuhut","v":0},null,null,{"$f":"ROUND(SUM(E359:L359)/26,0)","v":{"v":217769,"d":"217,769"}}]
[{"$nulls":3},2.66,{"$f":"D360*LTTV","v":{"v":5320000,"d":"5,320,000"}},{"$f":"$F$10","v":{"v":210000,"d":"210,000"}},{"$f":"E360*luongphu","v":{"v":638400,"d":"638,400"}},{"$f":"E360*khoantructiep","v":{"v":212800,"d":"212,800"}},{"$f":"E360*KhongOndinhSX","v":0},{"$f":"E360*thuhut","v":0},null,null,{"$f":"ROUND(SUM(E360:L360)/26,0)","v":{"v":245431,"d":"245,431"}}]
[{"$nulls":3},3.12,{"$f":"D361*LTTV","v":{"v":6240000,"d":"6,240,000"}},{"$f":"$F$10","v":{"v":210000,"d":"210,000"}},{"$f":"E361*luongphu","v":{"v":748800,"d":"748,800"}},{"$f":"E361*khoantructiep","v":{"v":249600,"d":"249,600"}},{"$f":"E361*KhongOndinhSX","v":0},{"$f":"E361*thuhut","v":0},null,null,{"$f":"ROUND(SUM(E361:L361)/26,0)","v":{"v":286477,"d":"286,477"}}]
[{"$nulls":3},3.73,{"$f":"D362*LTTV","v":{"v":7460000,"d":"7,460,000"}},{"$f":"$F$10","v":{"v":210000,"d":"210,000"}},{"$f":"E362*luongphu","v":{"v":895200,"d":"895,200"}},{"$f":"E362*khoantructiep","v":{"v":298400,"d":"298,400"}},{"$f":"E362*KhongOndinhSX","v":0},{"$f":"E362*thuhut","v":0},null,null,{"$f":"ROUND(SUM(E362:L362)/26,0)","v":{"v":340908,"d":"340,908"}}]
["3. Thuỷ thủ, thợ cuốc"]
[null,null,"1/4",2.18,{"$f":"D364*LTTV","v":{"v":4360000,"d":"4,360,000"}},{"$f":"$F$10","v":{"v":210000,"d":"210,000"}},{"$f":"E364*luongphu","v":{"v":523200,"d":"523,200"}},{"$f":"E364*khoantructiep","v":{"v":174400,"d":"174,400"}},{"$f":"E364*KhongOndinhSX","v":0},{"$f":"E364*thuhut","v":0},null,null,{"$f":"ROUND(SUM(E364:L364)/26,0)","v":{"v":202600,"d":"202,600"}}]
[null,null,"2/4",2.59,{"$f":"D365*LTTV","v":{"v":5180000,"d":"5,180,000"}},{"$f":"$F$10","v":{"v":210000,"d":"210,000"}},{"$f":"E365*luongphu","v":{"v":621600,"d":"621,600"}},{"$f":"E365*khoantructiep","v":{"v":207200,"d":"207,200"}},{"$f":"E365*KhongOndinhSX","v":0},{"$f":"E365*thuhut","v":0},null,null,{"$f":"ROUND(SUM(E365:L365)/26,0)","v":{"v":239185,"d":"239,185"}}]
[null,"N304TTvb","3/4",3.08,{"$f":"D366*LTTV","v":{"v":6160000,"d":"6,160,000"}},{"$f":"$F$10","v":{"v":210000,"d":"210,000"}},{"$f":"E366*luongphu","v":{"v":739200,"d":"739,200"}},{"$f":"E366*khoantructiep","v":{"v":246400,"d":"246,400"}},{"$f":"E366*KhongOndinhSX","v":0},{"$f":"E366*thuhut","v":0},null,null,{"$f":"ROUND(SUM(E366:L366)/26,0)","v":{"v":282908,"d":"282,908"}}]
[null,"N404TTvb","4/4",3.73,{"$f":"D367*LTTV","v":{"v":7460000,"d":"7,460,000"}},{"$f":"$F$10","v":{"v":210000,"d":"210,000"}},{"$f":"E367*luongphu","v":{"v":895200,"d":"895,200"}},{"$f":"E367*khoantructiep","v":{"v":298400,"d":"298,400"}},{"$f":"E367*KhongOndinhSX","v":0},{"$f":"E367*thuhut","v":0},null,null,{"$f":"ROUND(SUM(E367:L367)/26,0)","v":{"v":340908,"d":"340,908"}}]
["4. Phục vụ viên"]
[{"$nulls":3},1.75,{"$f":"D369*LTTV","v":{"v":3500000,"d":"3,500,000"}},{"$f":"$F$10","v":{"v":210000,"d":"210,000"}},{"$f":"E369*luongphu","v":{"v":420000,"d":"420,000"}},{"$f":"E369*khoantructiep","v":{"v":140000,"d":"140,000"}},{"$f":"E369*KhongOndinhSX","v":0},{"$f":"E369*thuhut","v":0},null,null,{"$f":"ROUND(SUM(E369:L369)/26,0)","v":{"v":164231,"d":"164,231"}}]
[{"$nulls":3},1.99,{"$f":"D370*LTTV","v":{"v":3980000,"d":"3,980,000"}},{"$f":"$F$10","v":{"v":210000,"d":"210,000"}},{"$f":"E370*luongphu","v":{"v":477600,"d":"477,600"}},{"$f":"E370*khoantructiep","v":{"v":159200,"d":"159,200"}},{"$f":"E370*KhongOndinhSX","v":0},{"$f":"E370*thuhut","v":0},null,null,{"$f":"ROUND(SUM(E370:L370)/26,0)","v":{"v":185646,"d":"185,646"}}]
[null,"Nvb274","2,7/4",{"$f":"D370+(D372-D370)*0.7","v":{"v":2.242,"d":"2.24"}},{"$f":"D371*LTTV","v":{"v":4484000,"d":"4,484,000"}},{"$f":"$F$10","v":{"v":210000,"d":"210,000"}},{"$f":"E371*luongphu","v":{"v":538080,"d":"538,080"}},{"$f":"E371*khoantructiep","v":{"v":179360,"d":"179,360"}},{"$f":"E371*KhongOndinhSX","v":0},{"$f":"E371*thuhut","v":0},null,null,{"$f":"ROUND(SUM(E371:L371)/26,0)","v":{"v":208132,"d":"208,132"}}]
[null,"Nvb304","3/4",2.35,{"$f":"D372*LTTV","v":{"v":4700000,"d":"4,700,000"}},{"$f":"$F$10","v":{"v":210000,"d":"210,000"}},{"$f":"E372*luongphu","v":{"v":564000,"d":"564,000"}},{"$f":"E372*khoantructiep","v":{"v":188000,"d":"188,000"}},{"$f":"E372*KhongOndinhSX","v":0},{"$f":"E372*thuhut","v":0},null,null,{"$f":"ROUND(SUM(E372:L372)/26,0)","v":{"v":217769,"d":"217,769"}}]
[{"$nulls":3},2.66,{"$f":"D373*LTTV","v":{"v":5320000,"d":"5,320,000"}},{"$f":"$F$10","v":{"v":210000,"d":"210,000"}},{"$f":"E373*luongphu","v":{"v":638400,"d":"638,400"}},{"$f":"E373*khoantructiep","v":{"v":212800,"d":"212,800"}},{"$f":"E373*KhongOndinhSX","v":0},{"$f":"E373*thuhut","v":0},null,null,{"$f":"ROUND(SUM(E373:L373)/26,0)","v":{"v":245431,"d":"245,431"}}]
["5. Cấp dưỡng"]
[{"$nulls":3},1.93,{"$f":"D375*LTTV","v":{"v":3860000,"d":"3,860,000"}},{"$f":"$F$10","v":{"v":210000,"d":"210,000"}},{"$f":"E375*luongphu","v":{"v":463200,"d":"463,200"}},{"$f":"E375*khoantructiep","v":{"v":154400,"d":"154,400"}},{"$f":"E375*KhongOndinhSX","v":0},{"$f":"E375*thuhut","v":0},null,null,{"$f":"ROUND(SUM(E375:L375)/26,0)","v":{"v":180292,"d":"180,292"}}]
[{"$nulls":3},2.38,{"$f":"D376*LTTV","v":{"v":4760000,"d":"4,760,000"}},{"$f":"$F$10","v":{"v":210000,"d":"210,000"}},{"$f":"E376*luongphu","v":{"v":571200,"d":"571,200"}},{"$f":"E376*khoantructiep","v":{"v":190400,"d":"190,400"}},{"$f":"E376*KhongOndinhSX","v":0},{"$f":"E376*thuhut","v":0},null,null,{"$f":"ROUND(SUM(E376:L376)/26,0)","v":{"v":220446,"d":"220,446"}}]
[{"$nulls":3},2.74,{"$f":"D377*LTTV","v":{"v":5480000,"d":"5,480,000"}},{"$f":"$F$10","v":{"v":210000,"d":"210,000"}},{"$f":"E377*luongphu","v":{"v":657600,"d":"657,600"}},{"$f":"E377*khoantructiep","v":{"v":219200,"d":"219,200"}},{"$f":"E377*KhongOndinhSX","v":0},{"$f":"E377*thuhut","v":0},null,null,{"$f":"ROUND(SUM(E377:L377)/26,0)","v":{"v":252569,"d":"252,569"}}]
[{"$nulls":3},3.15,{"$f":"D378*LTTV","v":{"v":6300000,"d":"6,300,000"}},{"$f":"$F$10","v":{"v":210000,"d":"210,000"}},{"$f":"E378*luongphu","v":{"v":756000,"d":"756,000"}},{"$f":"E378*khoantructiep","v":{"v":252000,"d":"252,000"}},{"$f":"E378*KhongOndinhSX","v":0},{"$f":"E378*thuhut","v":0},null,null,{"$f":"ROUND(SUM(E378:L378)/26,0)","v":{"v":289154,"d":"289,154"}}]
[]
["BẢNG BẢNG LƯƠNG KỸ SƯ, CHUYÊN VIÊN, KINH TẾ VIÊN"]
[null,"N28108",{"v":1,"d":"1.0"},{"v":2.34,"d":"2.340"},{"$f":"D381*LTTV","v":{"v":4680000,"d":"4,680,000"}},{"$f":"$F$10","v":{"v":210000,"d":"210,000"}},{"$f":"E381*luongphu","v":{"v":561600,"d":"561,600"}},{"$f":"E381*khoantructiep","v":{"v":187200,"d":"187,200"}},{"$f":"E381*KhongOndinhSX","v":0},{"$f":"E381*thuhut","v":0},0,null,{"$f":"ROUND(SUM(E381:L381)/26,0)","v":{"v":216877,"d":"216,877"}}]
[null,"N28208",{"v":2,"d":"2.0"},{"v":2.65,"d":"2.650"},{"v":5300000,"d":"5,300,000"},{"v":210000,"d":"210,000"},{"v":636000,"d":"636,000"},{"v":212000,"d":"212,000"},0,0,null,null,{"v":244538,"d":"244,538"}]
[null,"N28308",{"v":3,"d":"3.0"},{"v":2.96,"d":"2.960"},{"v":5920000,"d":"5,920,000"},{"v":210000,"d":"210,000"},{"v":710400,"d":"710,400"},{"v":236800,"d":"236,800"},0,0,null,null,{"v":272200,"d":"272,200"}]
[null,"N28408",{"v":4,"d":"4.0"},{"v":3.27,"d":"3.270"},{"v":6540000,"d":"6,540,000"},{"v":210000,"d":"210,000"},{"v":784800,"d":"784,800"},{"v":261600,"d":"261,600"},0,0,null,null,{"v":299862,"d":"299,862"}]
[null,"N28458",4.5,3.425,{"v":6850000,"d":"6,850,000"},{"v":210000,"d":"210,000"},{"v":822000,"d":"822,000"},{"v":274000,"d":"274,000"},0,0,null,null,{"v":313692,"d":"313,692"}]
[null,"N28508",{"v":5,"d":"5.0"},{"v":3.58,"d":"3.580"},{"v":7160000,"d":"7,160,000"},{"v":210000,"d":"210,000"},{"v":859200,"d":"859,200"},{"v":286400,"d":"286,400"},0,0,null,null,{"v":327523,"d":"327,523"}]
[null,"N28608",{"v":6,"d":"6.0"},{"v":3.89,"d":"3.890"},{"v":7780000,"d":"7,780,000"},{"v":210000,"d":"210,000"},{"v":933600,"d":"933,600"},{"v":311200,"d":"311,200"},0,0,null,null,{"v":355185,"d":"355,185"}]
[null,"N28708",{"v":7,"d":"7.0"},{"v":4.2,"d":"4.200"},{"v":8400000,"d":"8,400,000"},{"v":210000,"d":"210,000"},{"v":1008000,"d":"1,008,000"},{"v":336000,"d":"336,000"},0,0,null,null,{"v":382846,"d":"382,846"}]
[null,"N28808",{"v":8,"d":"8.0"},{"v":4.51,"d":"4.510"},{"v":9020000,"d":"9,020,000"},{"v":210000,"d":"210,000"},{"v":1082400,"d":"1,082,400"},{"v":360800,"d":"360,800"},0,0,null,null,{"v":410508,"d":"410,508"}]

{"sheet":"Morong","index":50,"n_rows":0,"n_cols":0,"rows_kept":0,"hidden":true}